program: Gaussian 09
title: 000223757
version: EM64L-G09RevD.01
frameworkgroup: C1[X(C20H19N5)]
method: RPBEPBE
basis: SDD
operation: Freq
keyword: #pfreq=noraman
keyword: PBEPBE/SDD
title: #p freq=noraman PBEPBE/SDD
converged: YES YES NO NO
title: Mulliken charges:
elementType: N N N N N C C C C C C C C C C C C C C C C C C C C H H H H H H H H H H H H H H H H H H H
charge: -0.290461 -0.387472 -0.070100 -0.113640 -0.003938 -0.026409 0.138422 0.245621 0.027942 -0.531828 -0.431991 0.397654 -0.452744 0.485200 -0.357470 -0.404499 -0.685674 -0.371002 -0.447155 -0.228220 -0.204905 -0.248028 -0.227574 -0.217237 -0.240808 0.310015 0.279250 0.225235 0.260509 0.225402 0.216581 0.316959 0.286225 0.231643 0.220757 0.225183 0.248882 0.232319 0.225098 0.226815 0.227434 0.228809 0.228028 0.231171
chargesum: 0.00000
title: Mulliken charges with hydrogens summed into heavy atoms:
elementType: N N N N N C C C C C C C C C C C C C C C C C C C C
charge: -0.290461 -0.077457 -0.070100 -0.113640 -0.003938 -0.026409 0.138422 0.245621 0.027942 -0.027342 -0.171481 0.397654 -0.010761 0.485200 -0.040511 -0.118274 -0.008091 -0.122120 -0.214837 -0.003122 0.021910 -0.020594 0.001234 0.010792 -0.009636
polarizability: 4.09451445e+02 2.44415733e+00 2.34766462e+02 -2.63441579e+01 1.01375685e+01 1.61634786e+02
1716.lowfreq: -11.8514 -3.0115 -0.0010 -0.0002 0.0005 1.4924 12.8145 21.0019 25.2182
frequency: 11.3516 20.1685 24.9187 26.9297 41.6304 52.3539 99.8059 100.4024 129.1687 148.6328 182.3776 201.5849 207.4290 217.9132 258.5535 269.9704 275.9939 295.1555 339.9977 377.8340 402.6903 405.1933 410.8324 426.7013 475.7486 500.8872 516.0848 541.4029 557.1455 593.5538 614.5412 616.0539 624.1132 631.3380 671.0256 674.3609 702.6963 706.1280 709.6685 713.8821 752.6171 772.5485 789.1293 790.5319 803.2199 813.5529 832.1024 856.9817 860.2630 907.1252 918.8187 940.5131 945.4948 979.5281 979.7780 987.2191 990.2607 991.9320 997.9870 1003.2838 1004.6900 1019.7627 1026.2192 1033.3243 1047.9185 1064.1814 1081.9237 1085.9696 1097.8158 1129.9765 1171.1123 1172.9137 1179.5546 1187.5418 1191.7591 1212.2341 1222.0890 1236.9089 1252.8369 1281.3363 1311.5258 1312.8220 1324.4486 1343.7418 1346.7285 1370.3047 1381.4196 1385.5908 1390.7728 1395.7544 1412.6878 1420.0160 1442.4161 1451.5808 1457.7547 1473.1898 1473.3819 1486.1924 1487.3494 1488.7555 1497.9655 1533.4741 1592.2742 1596.3322 1598.4498 1614.1619 1615.3245 2980.7988 2985.4299 3011.9791 3047.8749 3074.6488 3085.1967 3100.7248 3115.9563 3125.0599 3128.5856 3136.7554 3140.5041 3147.7399 3159.3947 3164.7291 3171.3262 3188.2563 3207.7003 3565.1607
redmass: 4.4425 3.8854 3.4243 4.0123 3.6611 6.2077 4.7997 4.0612 5.5877 3.1486 3.7978 2.8605 6.1484 1.6475 3.9143 3.3422 3.2000 5.7091 4.4668 4.0082 3.2683 2.9790 2.9758 3.6052 4.4061 4.1941 3.2903 1.3880 4.1928 5.5034 5.7347 6.3882 4.6205 6.5893 5.2417 9.8953 2.0849 1.9235 4.8880 5.7991 1.7381 1.6643 2.2157 3.5958 2.0293 3.5062 1.7572 1.2463 1.2477 2.4001 1.8246 1.4115 3.7854 1.8922 1.4859 6.1853 6.0737 1.3468 1.4014 4.5496 1.3042 3.2154 2.2225 2.1915 3.1163 1.9059 1.9353 1.5930 1.7661 3.8345 1.0594 1.0562 1.6942 1.1115 1.2800 2.1615 1.5202 1.5219 1.9129 3.3003 1.6217 1.4692 1.3908 3.5318 1.3726 2.2255 3.3968 5.5816 3.0177 5.4047 4.2593 2.1241 2.1463 2.3472 1.1382 1.0661 1.2148 1.8871 1.1735 2.3438 2.9823 7.4804 5.8981 6.9052 5.6405 5.9743 5.9634 1.0635 1.0344 1.0610 1.0974 1.0997 1.1006 1.1022 1.0875 1.0861 1.0853 1.0912 1.0907 1.0961 1.0961 1.1015 1.0977 1.0952 1.0972 1.0773
irintensity: 0.0212 0.0047 0.0994 0.5405 0.0570 0.4705 1.4924 0.8447 0.1807 0.2581 0.9046 0.9878 1.6390 0.8701 2.2153 0.2820 2.1946 5.6816 4.2048 4.4344 4.6975 1.2606 0.0373 5.1663 7.0195 21.3040 13.6079 67.1825 12.7090 13.8649 3.9628 0.1212 9.0834 6.1563 32.4558 16.2868 37.9493 41.4964 9.3831 3.4286 51.9780 63.1131 1.8830 23.2242 12.5400 12.3167 11.2378 0.2897 0.0251 18.1202 21.3645 9.9327 55.8915 0.7828 0.4572 2.7276 0.2897 0.2524 2.2734 16.4040 2.4230 0.4239 8.1455 5.5543 9.4170 35.9387 31.3576 18.5993 26.3407 17.2891 0.0606 0.0865 2.5793 5.5475 10.5142 16.3403 76.3419 34.7614 18.1798 4.5020 5.9182 3.7996 21.2296 218.2445 21.2347 68.7309 16.9026 23.7162 91.8367 62.8009 37.4020 16.5978 23.1909 24.0653 16.6204 6.3070 39.4583 15.2078 17.7459 200.9480 66.6320 223.5443 372.5095 7.8771 402.5095 9.7407 9.6258 58.4246 43.1879 18.8556 19.5312 3.0208 44.6085 41.2829 8.7082 2.2088 0.0006 12.5702 26.2569 41.4301 19.2030 25.2689 37.3103 4.5555 2.6533 57.8679
temp: 298.150 k
press: 1.00000 atm
elementType: 7 7 7 7 7 6 6 6 6 6 6 6 6 6 6 6 6 6 6 6 6 6 6 6 6 1 1 1 1 1 1 1 1 1 1 1 1 1 1 1 1 1 1 1
symmnumber: 1
zpe: 921910.6 jmol-1
zpe.correction: 0.351137 hartree
zpe.thermalcorrener: 0.372263 hartree
zpe.thermalcorrenthalpy: 0.373207 hartree
zpe.thermalcorrgfe: 0.296982 hartree
zpe.sumelectzpe: -1045.547347 hartree
zpe.sumelectthermal: -1045.526221 hartree
zpe.sumelectthermalent: -1045.525276 hartree
zpe.sumelectthermalfe: -1045.601502 hartree
dipole: 3.1811 -0.5549 -0.7144
dipole: 3.3072
quadrupole: -128.4338 -142.5553 -143.3698
quadrupole: -6.7875 -6.1838 1.3242
quadrupole: 9.6858 -4.4357 -5.2502 -6.7875 -6.1838 1.3242
hfenergy: -1045.8984838 hartree
pointgroup: C01 [X(C20H19N5)]
dipole: 1.2509393 0.1616706 0.319471 debye
polarizability: 406.6427166|-10.8174245|235.8640177|35.3959147|6.5302581|163.3459597 unknown
InChI: InChI=1S/C20H19N5/c1-2-18-23-19(21-13-15-9-5-3-6-10-15)17-14-22-25(20(17)24-18)16-11-7-4-8-12-16/h3-12,14,21H,2,13H2,1H3
charge 0 multiplicity 1
44 atoms
N  -2.459556 0.98599 0.209842
N  2.095967 0.159836 1.129079
N  -1.626402 -1.315506 -0.239256
N  0.748266 -1.585796 0.285773
N  -1.91325 2.193483 0.694306
C  -0.275615 0.576152 0.645377
C  -1.487939 -0.016067 0.169074
C  0.870509 -0.285645 0.691807
C  -0.47253 -2.041889 -0.155524
C  3.302112 -0.683427 1.198437
C  -0.608436 1.935417 0.95024
C  -3.848814 0.950158 -0.149087
C  -0.535526 -3.500562 -0.551854
C  4.477174 -0.091227 0.4272
C  -4.43037 -0.240053 -0.65469
C  -4.628089 2.123421 0.010005
C  -0.509423 -4.430483 0.690307
C  4.313169 0.349396 -0.911611
C  5.756123 0.004009 1.028141
C  -5.799137 -0.242704 -0.998538
C  -5.993574 2.099424 -0.339195
C  -6.588561 0.919579 -0.844818
C  5.408119 0.870972 -1.633859
C  6.855548 0.522889 0.305625
C  6.684374 0.958725 -1.027768
H  2.182682 1.139467 1.401532
H  3.002422 -1.663002 0.784031
H  3.59061 -0.84301 2.256361
H  0.013318 2.74127 1.338374
H  -1.459487 -3.664871 -1.131117
H  0.332883 -3.731568 -1.19548
H  -3.812519 -1.133835 -0.76876
H  -4.155841 3.027077 0.400961
H  0.408521 -4.259572 1.279454
H  -0.534449 -5.490578 0.380277
H  -1.382063 -4.240416 1.34049
H  3.326146 0.279303 -1.383903
H  5.894027 -0.329258 2.064679
H  -6.247978 -1.162765 -1.38936
H  -6.59409 3.007442 -0.215237
H  -7.650198 0.907441 -1.114425
H  5.269665 1.205544 -2.668161
H  7.839635 0.590485 0.7829
H  7.534077 1.363558 -1.588628
