program: Gaussian 09
title: 000223738
version: EM64L-G09RevD.01
frameworkgroup: C1[X(C14H15N5)]
method: RPBEPBE
basis: SDD
operation: Freq
keyword: #pfreq=noraman
keyword: PBEPBE/SDD
title: #p freq=noraman PBEPBE/SDD
converged: YES YES NO NO
title: Mulliken charges:
elementType: N N N N N C C C C C C C C C C C C C C H H H H H H H H H H H H H H H
charge: -0.245627 -0.168561 -0.112417 -0.028435 -0.047055 0.194644 0.025524 -0.350479 0.125443 0.400035 -0.375033 -0.673908 -0.375617 -0.354241 -0.612864 -0.388496 -0.207996 -0.217190 -0.241192 0.217536 0.255331 0.280606 0.252842 0.219395 0.216527 0.251540 0.267706 0.243078 0.262616 0.244033 0.242676 0.231346 0.233905 0.234327
chargesum: 0.00000
title: Mulliken charges with hydrogens summed into heavy atoms:
elementType: N N N N N C C C C C C C C C C C C C C
charge: -0.245627 -0.168561 -0.112417 -0.028435 -0.047055 0.194644 0.025524 0.122388 0.125443 0.400035 -0.094427 0.014857 -0.124078 -0.086535 0.136864 -0.145820 0.023350 0.016715 -0.006865
polarizability: 2.39188323e+02 -1.28930633e+01 2.01758880e+02 -1.02969140e+01 -4.85739270e+00 1.22947786e+02
1716.lowfreq: -7.2188 -1.9413 -0.0007 0.0002 0.0005 9.2022 30.3061 45.5279 62.4375
frequency: 30.2626 45.4858 62.3971 63.9535 72.6162 104.7093 126.0525 175.7807 182.9852 220.8005 238.9195 252.2808 280.2073 289.5183 306.3294 331.7652 408.1725 426.7614 473.5458 509.1205 522.2609 547.9412 572.5762 612.9469 625.9031 630.4500 665.4675 667.7562 701.2437 732.6850 758.8338 769.5988 785.1148 813.4265 835.5908 848.6807 885.3559 913.2944 925.7282 933.3691 957.3821 976.3723 988.9554 996.2040 1003.1502 1023.1562 1075.2485 1081.4625 1095.7000 1129.1146 1136.6823 1143.2550 1172.6448 1179.8137 1181.4990 1218.4999 1245.7564 1253.0439 1292.5810 1310.2416 1315.5692 1337.3420 1353.4766 1362.7754 1374.6800 1382.3771 1402.9428 1419.6767 1429.7397 1438.3205 1454.0429 1464.8166 1467.8979 1469.4060 1484.5247 1485.8402 1487.7264 1533.8182 1554.4474 1589.0382 1607.2136 2986.6172 3003.0157 3019.9798 3076.4544 3091.6887 3094.5748 3108.4357 3124.3515 3130.2676 3136.7786 3148.8739 3156.9285 3157.0525 3170.2571 3240.9371
redmass: 4.2623 4.7253 3.7522 3.2395 3.4891 1.1538 3.0739 4.2822 3.1106 1.3338 3.1650 5.3580 4.0393 4.8949 4.4469 2.3978 2.8615 4.1019 4.9316 5.0193 6.0703 4.1454 3.5568 6.2573 5.4182 5.6400 6.8212 9.6810 1.8828 6.4437 1.6678 1.7776 4.3719 2.6434 1.5265 1.2481 4.5608 2.2946 1.7040 1.4403 2.7638 1.3789 5.8729 1.3241 3.3196 2.0786 1.8385 2.1748 2.4722 1.3097 3.0321 2.3141 1.0544 1.4311 1.5319 2.0802 6.6436 2.8163 1.6327 1.3773 4.2828 4.2242 1.5087 2.1841 7.6572 1.2172 1.9853 1.7049 1.7521 2.0192 1.5303 2.0066 1.1015 1.0430 1.1363 2.2964 1.3803 5.1613 8.8568 6.3837 6.1718 1.0355 1.0331 1.0620 1.1000 1.0983 1.1025 1.1033 1.1015 1.0850 1.0882 1.0927 1.0969 1.0920 1.1017 1.0977
irintensity: 0.8513 0.1178 0.4927 1.9558 0.5021 0.0643 0.6838 2.2325 1.9264 1.2504 4.2372 3.2407 1.5217 2.9434 0.5144 1.4579 0.4412 2.9528 7.3507 0.6691 1.8019 2.5668 16.4862 0.4138 13.8388 0.2521 11.1787 2.1067 52.6861 17.7678 8.7578 44.0779 15.4299 20.0182 7.0346 1.1752 15.8580 4.7893 3.3267 10.7394 11.2306 0.0164 1.0873 0.0219 0.4946 11.0875 16.2241 2.3348 62.0054 0.8583 10.2072 15.9309 0.0234 4.5358 12.8174 0.3013 48.6735 32.3227 9.7479 1.2133 41.2251 181.9407 1.7735 1.0462 2.0079 26.0176 19.7600 13.1397 89.4565 19.8911 48.8252 4.4882 13.8433 15.8384 33.3539 66.5613 16.8238 245.8422 482.5018 8.8671 13.2790 29.9296 57.6560 30.0981 21.5502 22.6329 19.4948 23.3246 3.0316 2.2275 2.2369 19.3936 24.0378 24.4810 13.5391 1.6990
temp: 298.150 k
press: 1.00000 atm
elementType: 7 7 7 7 7 6 6 6 6 6 6 6 6 6 6 6 6 6 6 1 1 1 1 1 1 1 1 1 1 1 1 1 1 1
symmnumber: 1
zpe: 711015.7 jmol-1
zpe.correction: 0.270812 hartree
zpe.thermalcorrener: 0.287391 hartree
zpe.thermalcorrenthalpy: 0.288335 hartree
zpe.thermalcorrgfe: 0.225454 hartree
zpe.sumelectzpe: -814.882264 hartree
zpe.sumelectthermal: -814.865685 hartree
zpe.sumelectthermalent: -814.864740 hartree
zpe.sumelectthermalfe: -814.927621 hartree
dipole: 3.0311 -0.5868 0.0216
dipole: 3.0874
quadrupole: -101.0465 -113.0594 -107.0843
quadrupole: 0.4138 -2.8772 -2.4945
quadrupole: 6.0169 -5.9960 -0.0209 0.4138 -2.8772 -2.4945
hfenergy: -815.1530759 hartree
pointgroup: C01 [X(C14H15N5)]
dipole: -1.2015526 0.1699036 -0.0536455 debye
polarizability: 238.9855476|-11.4757235|200.317378|16.1283958|6.2289784|124.5920636 unknown
InChI: InChI=1S/C14H15N5/c1-3-19(11-7-5-4-6-8-11)14-12-9-17-18(2)13(12)15-10-16-14/h4-10H,3H2,1-2H3
charge 0 multiplicity 1
34 atoms
N  -0.965777 -1.169602 -0.398919
N  2.969057 1.449098 0.185378
N  1.131949 -2.189357 -0.090311
N  1.935648 2.381405 0.025811
N  3.24654 -0.989033 0.225553
C  0.393626 -1.029752 -0.169227
C  1.072996 0.236115 -0.058487
C  -1.541299 -2.52715 -0.632064
C  2.495364 0.15233 0.135928
C  -1.891079 -0.071481 -0.241673
C  0.799028 1.646067 -0.122466
C  -1.936771 -3.235859 0.678884
C  -2.672818 0.35162 -1.344769
C  -2.057916 0.551411 1.0207
C  4.350871 1.884528 0.366254
C  2.485114 -2.107886 0.094181
C  -3.61121 1.395535 -1.186848
C  -2.98912 1.602537 1.170802
C  -3.769925 2.026467 0.069646
H  -2.423261 -2.399893 -1.285227
H  -0.782068 -3.122748 -1.16323
H  -0.145899 2.163996 -0.263187
H  -1.0411 -3.404538 1.299788
H  -2.668106 -2.639474 1.253906
H  -2.394443 -4.217044 0.454914
H  -2.528311 -0.124635 -2.320757
H  -1.456438 0.212974 1.870935
H  4.443566 2.498338 1.277986
H  4.97486 0.982059 0.459881
H  4.682179 2.478312 -0.50211
H  3.014087 -3.064622 0.145892
H  -4.208176 1.723129 -2.045006
H  -3.110179 2.083389 2.14761
H  -4.493987 2.839563 0.18943
