program: Gaussian 09
title: 000223723
version: EM64L-G09RevD.01
frameworkgroup: C1[X(C12H12N4O2)]
method: RPBEPBE
basis: SDD
operation: Freq
keyword: #p
keyword: freq=noraman
keyword: PBEPBE/SDD
title: #p freq=noraman PBEPBE/SDD
converged: YES YES NO NO
title: Mulliken charges:
elementType: O O N N N N C C C C C C C C C C C C H H H H H H H H H H H H
charge: -0.340117 -0.218526 -0.293846 -0.417440 -0.025602 -0.622680 0.339352 -0.036177 0.520494 -0.397048 -0.351459 -0.381452 0.223678 -0.211674 -0.207224 0.205470 -0.243016 -0.774537 0.255088 0.366685 0.252433 0.266233 0.226087 0.228427 0.228805 0.236592 0.257696 0.249954 0.325123 0.338680
chargesum: 0.00000
title: Mulliken charges with hydrogens summed into heavy atoms:
elementType: O O N N N N C C C C C C C C C C C C
charge: -0.340117 -0.218526 -0.293846 -0.050755 -0.025602 0.041123 0.339352 -0.036177 0.520494 -0.141960 -0.099026 -0.115219 0.223678 0.014414 0.021202 0.205470 -0.014211 -0.030295
polarizability: 2.42413787e+02 1.06182400e+01 1.70841857e+02 -5.85609400e+00 1.95582534e+01 9.61827076e+01
1716.lowfreq: -10.9106 -5.7638 -0.0008 -0.0004 -0.0002 4.9915 28.8054 38.1752 51.4211
frequency: 28.1732 38.1579 51.4128 57.3652 75.0382 99.5453 115.2654 120.6985 179.9344 205.2372 260.6261 279.7478 289.1526 322.8913 357.3027 405.6808 420.1836 467.3442 485.1412 499.6528 546.4827 556.3000 573.9160 595.8231 611.0679 636.7412 639.5968 672.2028 692.4315 713.2161 746.9214 763.8870 781.1830 833.2507 838.8456 847.3456 916.9525 934.5128 964.6818 971.6029 990.0104 991.4698 997.7710 1016.8933 1029.8738 1040.4493 1044.7423 1086.5184 1102.0698 1172.6648 1184.3148 1196.5902 1223.8361 1284.3394 1306.0974 1319.8113 1378.9068 1386.8258 1388.1404 1403.9590 1445.6679 1448.7275 1463.2099 1472.1289 1497.1520 1502.9090 1558.5955 1585.9349 1604.1879 1613.2398 1624.1006 1639.6613 2994.0007 3083.1383 3125.0364 3130.8939 3141.3286 3154.6562 3166.8966 3181.9327 3191.0400 3204.5675 3532.4301 3686.6962
redmass: 1.0495 3.9467 5.2381 6.2330 3.6308 5.2367 6.7950 5.4073 6.1189 5.2355 6.0690 6.1549 5.8517 3.7769 4.4178 2.8724 4.7497 7.9330 1.2466 3.2515 1.7755 2.3127 2.9323 3.7184 6.1700 4.9527 4.6099 6.3435 2.0967 5.8078 3.7063 1.8038 4.1504 1.5219 1.2639 1.6991 1.4428 3.8845 3.1250 1.3887 4.0903 1.4933 2.0468 3.5641 2.5232 1.6938 2.0209 1.7569 2.4949 1.0527 1.1242 1.4820 3.2890 5.0077 4.5875 1.3183 3.5049 1.3137 7.4608 4.8613 2.4011 1.0776 1.2899 1.9161 4.6374 3.3502 5.2980 2.6005 6.8105 6.1679 1.6480 3.7043 1.0378 1.0973 1.0998 1.0850 1.0892 1.0942 1.0989 1.0975 1.0797 1.0972 1.0449 1.1045
irintensity: 0.3786 0.7091 3.4524 1.9893 4.3342 7.7257 6.4840 4.5823 1.6915 10.1644 0.7376 1.6799 3.4720 1.9161 2.0938 0.2859 0.2151 6.4244 118.9198 14.0358 93.7790 58.7601 12.8514 3.1826 0.0501 3.3856 3.8466 22.5823 28.7483 22.0768 27.0305 46.0562 68.4226 21.2572 2.0483 64.6836 5.1081 24.3354 31.1959 1.0898 0.5835 0.1562 12.4678 18.5886 1.8484 19.7217 12.4205 9.5118 8.6977 0.0826 2.2448 5.1816 89.4531 160.5931 11.3392 1.5517 188.9652 22.3550 17.1188 137.1862 18.6838 24.3776 41.3642 14.4133 167.1082 32.3083 291.2707 666.2869 23.3755 15.1557 177.6658 46.6994 6.1905 12.5451 10.1586 0.5117 9.6290 30.4272 21.6697 4.2098 269.9870 3.2395 79.6381 32.9743
temp: 298.150 k
press: 1.00000 atm
elementType: 8 8 7 7 7 7 6 6 6 6 6 6 6 6 6 6 6 6 1 1 1 1 1 1 1 1 1 1 1 1
symmnumber: 1
zpe: 599262.9 jmol-1
zpe.correction: 0.228247 hartree
zpe.thermalcorrener: 0.244568 hartree
zpe.thermalcorrenthalpy: 0.245513 hartree
zpe.thermalcorrgfe: 0.182584 hartree
zpe.sumelectzpe: -832.670281 hartree
zpe.sumelectthermal: -832.653959 hartree
zpe.sumelectthermalent: -832.653015 hartree
zpe.sumelectthermalfe: -832.715944 hartree
dipole: -2.4303 -0.8449 1.1591
dipole: 2.8220
quadrupole: -82.8660 -95.7688 -107.9925
quadrupole: 11.6597 5.3059 7.2597
quadrupole: 12.6764 -0.2264 -12.4500 11.6597 5.3059 7.2597
hfenergy: -832.898528 hartree
pointgroup: C01 [X(C12H12N4O2)]
dipole: 0.9173903 -0.4031689 -0.4780716 debye
polarizability: 240.3991517|-15.2786824|168.778033|-13.1913515|-23.6289207|100.2611668 unknown
InChI: InChI=1S/C12H12N4O2/c1-8(17)15-12-10(11(13)18)7-14-16(12)9-5-3-2-4-6-9/h2-7,15H,13H2,1H3
charge 0 multiplicity 1
30 atoms
O  3.577044 0.720813 -0.803801
O  -0.714594 2.043104 1.103811
N  -0.256442 -0.871434 0.086926
N  0.94875 1.286931 -0.369286
N  0.102231 -2.227134 0.306025
N  4.393315 -1.37439 -0.240723
C  0.861104 -0.090927 -0.152176
C  1.987128 -0.959741 -0.138098
C  -1.659701 -0.564476 0.004722
C  1.449676 -2.251685 0.159578
C  -2.135397 0.326709 -0.983496
C  -2.553703 -1.227681 0.873755
C  3.350971 -0.485269 -0.408975
C  -3.519959 0.577092 -1.079079
C  -3.93653 -0.97277 0.765596
C  0.215417 2.294727 0.290792
C  -4.42525 -0.068358 -0.205912
C  0.634595 3.70684 -0.096591
H  1.964664 -3.206796 0.262419
H  1.892463 1.517106 -0.752911
H  -1.436626 0.810088 -1.673767
H  -2.159626 -1.929326 1.613305
H  -3.891145 1.271199 -1.840898
H  -4.632276 -1.479629 1.442967
H  -5.499897 0.128776 -0.283325
H  1.689303 3.767969 -0.415474
H  0.46721 4.376574 0.760924
H  0.002557 4.063158 -0.931414
H  4.251022 -2.32094 0.104125
H  5.337997 -1.05173 -0.445221
