program: Gaussian 09
title: 000223722
version: EM64L-G09RevD.01
frameworkgroup: C1[X(C12H12N2O3)]
method: RPBEPBE
basis: SDD
operation: Freq
keyword: #p
keyword: freq=noraman
keyword: PBEPBE/SDD
title: #p freq=noraman PBEPBE/SDD
converged: NO YES NO NO
title: Mulliken charges:
elementType: O O O N N C C C C C C C C C C C C H H H H H H H H H H H H
charge: -0.243883 -0.231866 -0.282295 -0.254715 -0.251488 0.459343 0.001036 0.168615 -0.237849 -0.349319 -0.410544 0.217809 -0.212310 -0.202122 -0.250773 -0.258651 -0.668957 0.332628 0.299758 0.302701 0.227416 0.232316 0.229408 0.233420 0.230096 0.225539 0.213815 0.234157 0.246713
chargesum: 0.00000
title: Mulliken charges with hydrogens summed into heavy atoms:
elementType: O O O N N C C C C C C C C C C C C
charge: -0.243883 -0.231866 -0.282295 -0.254715 0.081140 0.459343 0.001036 0.168615 0.061909 -0.046618 -0.183128 0.217809 0.020007 0.027287 -0.017353 0.196985 0.025729
polarizability: 2.54461931e+02 -2.95704200e+00 1.57366367e+02 9.08976434e+00 9.41250038e+00 7.76626924e+01
1716.lowfreq: -6.9955 0.0003 0.0004 0.0005 1.5430 8.9869 32.3683 40.1446 58.4003
frequency: 32.3551 39.7597 58.3729 62.8158 83.2293 94.5947 151.5597 173.2075 218.3005 253.5037 275.5238 283.4154 305.2645 334.5636 363.8408 398.1634 407.9474 416.4904 457.9951 498.1430 550.1783 611.1662 622.0320 671.9210 675.3368 692.8297 723.2159 747.3698 749.4661 761.1986 816.6427 824.2988 833.5007 863.3156 877.6184 904.6513 968.3880 983.2406 990.9736 994.6530 1011.2003 1030.7300 1071.0242 1093.9168 1096.3832 1102.6666 1157.2911 1175.4871 1192.0349 1211.7358 1275.0344 1280.5044 1310.2937 1330.6513 1332.9562 1365.5597 1380.8845 1390.6722 1445.0791 1455.9337 1457.7310 1463.5392 1485.6296 1490.1614 1562.4915 1589.4914 1600.4168 1613.0405 1655.3967 2992.3817 3029.1416 3088.0480 3094.0854 3119.9812 3126.7642 3138.4890 3149.8237 3168.4781 3193.7104 3236.3875 3567.7461
redmass: 4.7218 3.6741 5.4784 5.9141 4.3095 3.6477 4.2203 5.1031 1.3422 4.5216 6.5325 6.3745 2.8850 6.4706 4.4356 1.9757 2.3281 4.9246 3.2696 3.2049 3.0319 6.1953 6.0355 8.8812 7.0493 2.0630 6.3748 4.7902 3.8085 1.7870 1.3978 3.5100 1.2979 1.5422 4.8009 1.4165 1.3659 5.0732 3.7635 1.4336 3.0699 2.0476 2.1309 2.5258 1.6681 3.4395 1.6980 1.0520 1.1999 1.8876 2.2733 1.1491 3.1271 1.5865 2.5485 1.5947 7.5558 1.2372 2.4061 1.8063 1.3027 1.0447 1.0532 2.5062 6.3649 6.4602 9.0170 6.2880 12.1649 1.0361 1.0599 1.0974 1.1026 1.1059 1.0861 1.0881 1.0941 1.0997 1.0959 1.0999 1.0816
irintensity: 1.0287 1.6379 7.1146 5.3879 0.7124 0.3252 5.8984 1.8590 2.5372 5.5779 0.6575 5.1359 14.0451 5.3502 15.5130 141.3463 72.8888 12.6376 3.2948 12.3820 2.5625 0.6892 6.2697 7.4100 3.6905 31.0057 5.6043 20.3347 11.3068 96.3735 15.1005 9.0111 1.9471 15.0464 97.5722 8.1690 1.1356 0.0820 7.9185 2.2969 66.1586 30.3212 29.5391 158.2951 11.7863 181.5334 45.9492 0.1939 18.6777 75.1987 31.1341 15.8637 217.2370 0.4430 61.5131 16.7271 4.0585 22.9645 18.0094 27.4171 9.4979 15.9430 15.7981 153.9128 138.5489 2.4751 431.6826 7.0494 281.3809 23.7449 36.8200 41.9775 1.3438 29.3887 9.4537 2.3972 28.0308 21.2138 5.7048 9.7842 86.0132
temp: 298.150 k
press: 1.00000 atm
elementType: 8 8 8 7 7 6 6 6 6 6 6 6 6 6 6 6 6 1 1 1 1 1 1 1 1 1 1 1 1
symmnumber: 1
zpe: 582007.3 jmol-1
zpe.correction: 0.221675 hartree
zpe.thermalcorrener: 0.237209 hartree
zpe.thermalcorrenthalpy: 0.238153 hartree
zpe.thermalcorrgfe: 0.177311 hartree
zpe.sumelectzpe: -798.407853 hartree
zpe.sumelectthermal: -798.392319 hartree
zpe.sumelectthermalent: -798.391375 hartree
zpe.sumelectthermalfe: -798.452217 hartree
dipole: 3.2599 3.1839 -0.1926
dipole: 4.5608
quadrupole: -83.0991 -90.6869 -100.6352
quadrupole: 11.0941 0.2113 0.5080
quadrupole: 8.3746 0.7868 -9.1614 11.0941 0.2113 0.5080
hfenergy: -798.6295283 hartree
pointgroup: C01 [X(C12H12N2O3)]
dipole: -1.2282299 1.2932199 -0.1969642 debye
polarizability: 254.8763767|-0.273924|148.6023293|4.2290637|-26.7190479|86.0122845 unknown
InChI: InChI=1S/C12H12N2O3/c1-2-17-12(16)10-8-13-14(11(10)15)9-6-4-3-5-7-9/h3-8,13H,2H2,1H3
charge 0 multiplicity 1
29 atoms
O  3.194765 -0.961831 0.511633
O  0.262026 -1.619637 0.665952
O  3.7046 1.225441 -0.151214
N  -0.898947 0.420742 0.180409
N  -0.509069 1.721724 -0.188096
C  -2.266897 0.032643 0.143116
C  1.405093 0.55053 0.113669
C  0.303148 -0.397077 0.37088
C  0.859556 1.79797 -0.180486
C  -2.678863 -1.146414 0.82075
C  -3.219659 0.823982 -0.55413
C  2.857903 0.332069 0.133297
C  -4.040486 -1.510112 0.802438
C  -4.580281 0.449734 -0.547166
C  -5.000425 -0.715904 0.131952
C  4.653111 -1.287905 0.527621
C  5.122393 -1.725468 -0.863113
H  -1.168687 2.489887 -0.063693
H  1.383204 2.730599 -0.379995
H  -1.933228 -1.7609 1.328932
H  -2.908595 1.69555 -1.141421
H  -4.352135 -2.421913 1.323407
H  -5.307982 1.063736 -1.089036
H  -6.056329 -1.0054 0.131207
H  5.212373 -0.403524 0.880889
H  4.722939 -2.105081 1.26289
H  6.174646 -2.062612 -0.813259
H  4.507289 -2.562281 -1.236297
H  5.061538 -0.887951 -1.57824
