program: Gaussian 09
title: 000223716
version: EM64L-G09RevD.01
frameworkgroup: C1[X(C12H8ClN5O3)]
method: RPBEPBE
basis: SDD
operation: Freq
keyword: #p
keyword: freq=noraman
keyword: PBEPBE/SDD
title: #p freq=noraman PBEPBE/SDD
converged: NO YES NO NO
title: Mulliken charges:
elementType: Cl O O O N N N N N C C C C C C C C C C C C H H H H H H H H
charge: 0.023717 -0.286753 -0.202817 -0.202826 -0.170772 0.003681 0.058766 0.028366 0.024555 0.054729 0.173398 0.159345 -0.396429 0.432429 -0.606791 -0.316893 -0.317158 -0.346667 0.392308 -0.334257 -0.334210 0.285426 0.253699 0.253677 0.263246 0.262646 0.262688 0.291446 0.291452
chargesum: 0.00000
title: Mulliken charges with hydrogens summed into heavy atoms:
elementType: Cl O O O N N N N N C C C C C C C C C C C C
charge: 0.023717 -0.286753 -0.202817 -0.202826 -0.170772 0.003681 0.058766 0.028366 0.024555 0.054729 0.173398 0.159345 -0.111003 0.432429 0.163831 -0.054246 -0.054470 -0.346667 0.392308 -0.042811 -0.042758
polarizability: 2.93711513e+02 2.91534583e+01 1.66298485e+02 -5.67710467e-02 9.87765447e-02 1.28342999e+02
1716.lowfreq: -30.2993 -9.8717 -2.1450 -0.0017 -0.0015 -0.0014 3.0372 21.3238 30.2649
frequency: -30.2686 20.9312 30.2594 64.7265 89.1729 93.5652 106.3818 123.2962 157.9748 192.6699 192.7343 223.6848 258.3360 266.9982 326.4470 345.1732 368.8690 388.0493 389.3788 411.8067 466.3095 508.6111 514.4654 533.1141 611.5354 613.7406 622.7232 645.7367 655.4997 663.4862 681.7168 703.4653 745.5125 756.6010 777.5605 779.7782 811.5921 834.0295 843.9805 859.7151 886.8937 948.2631 981.4386 988.3291 1001.0513 1015.9447 1089.0372 1100.9669 1129.5924 1129.6166 1153.3706 1175.8942 1187.3152 1217.9566 1220.3669 1240.8431 1282.7404 1296.0496 1338.2057 1358.9452 1365.9268 1386.0778 1403.6390 1417.7342 1424.2878 1463.7587 1466.4166 1467.9592 1485.4703 1523.5346 1582.8374 1603.6770 1607.9062 3010.7116 3106.2911 3130.3936 3171.4592 3171.8202 3190.3943 3193.2315 3241.7077
redmass: 4.8859 6.9066 12.3804 9.3900 3.3060 1.2190 9.3013 5.7962 6.4895 6.1800 6.8553 9.5236 6.9687 6.2037 5.6984 7.3881 16.8345 8.5356 7.4657 2.9345 4.7823 6.9231 6.1705 5.3488 7.9643 8.5987 7.2091 10.2746 5.5028 9.0522 5.7066 6.5785 5.9842 9.3906 7.1394 4.6497 7.7138 1.2428 1.5053 2.1985 4.6680 2.9650 1.3535 1.3661 3.0553 5.4825 3.2360 1.2538 1.4556 2.6003 1.8153 1.9546 2.2255 3.9932 4.0238 9.8244 1.2605 10.0581 7.3527 11.7471 7.9021 5.2609 8.6043 4.5990 1.4514 2.2265 1.0420 2.0507 1.8597 3.9769 9.4106 6.8959 8.4642 1.0330 1.1028 1.1022 1.0903 1.0900 1.0963 1.0975 1.0985
irintensity: 0.0255 0.0020 0.2522 0.0003 1.2509 0.0103 5.1215 1.2094 0.6921 2.3850 0.4501 4.6546 8.9089 0.2653 4.6774 0.0965 5.7342 1.4868 4.6193 0.0640 8.1240 0.1110 4.6621 6.7739 0.0057 14.3483 0.3168 1.6235 18.8184 0.3067 5.0271 13.2040 2.9362 17.9359 18.2573 15.0284 33.5726 0.0012 14.9244 12.3586 152.3286 42.3111 1.6818 0.0660 20.6152 131.0611 5.0418 20.3719 21.7666 106.0162 258.1336 82.0449 15.8325 216.6178 177.5033 133.8141 1.4218 84.2955 400.2586 125.8235 93.7888 30.7826 3.2786 44.8074 1.5356 166.0954 17.8717 63.8697 77.2646 145.9055 388.6293 7.1423 6.2953 36.7797 13.2854 2.9075 1.3210 1.0486 0.5523 6.8422 0.8499
temp: 298.150 k
press: 1.00000 atm
elementType: 17 8 8 8 7 7 7 7 7 6 6 6 6 6 6 6 6 6 6 6 6 1 1 1 1 1 1 1 1
symmnumber: 1
zpe: 507442.0 jmol-1
zpe.correction: 0.193274 hartree
zpe.thermalcorrener: 0.210032 hartree
zpe.thermalcorrenthalpy: 0.210976 hartree
zpe.thermalcorrgfe: 0.146547 hartree
zpe.sumelectzpe: -1419.985526 hartree
zpe.sumelectthermal: -1419.968769 hartree
zpe.sumelectthermalent: -1419.967825 hartree
zpe.sumelectthermalfe: -1420.032254 hartree
dipole: -5.3703 -2.6415 0.0018
dipole: 5.9848
quadrupole: -148.6544 -134.5378 -119.6769
quadrupole: -6.2889 -0.0011 0.0249
quadrupole: -14.3647 -0.2481 14.6128 -6.2889 -0.0011 0.0249
hfenergy: -1420.1788008 hartree
pointgroup: C01 [X(C12H8Cl1N5O3)]
dipole: 2.1621405 -0.9323527 0.0001583 debye
polarizability: 296.3038849|-22.6473728|163.7058876|-0.0328761|-0.1347343|128.3432249 unknown
InChI: InChI=1S/C12H8ClN5O3/c1-17-10-9(6-14-17)11(16-12(13)15-10)21-8-4-2-7(3-5-8)18(19)20/h2-6H,1H3
charge 0 multiplicity 1
29 atoms
Cl 1.332644 3.661667 -0.001148
O  0.132916 -1.24683 0.000364
O  -5.988242 0.185739 -1.140896
O  -5.989399 0.181224 1.140704
N  4.691443 -0.242012 -0.000071
N  4.590719 -1.643216 0.000346
N  3.157174 1.687052 -0.000769
N  0.809137 1.024011 -0.000493
N  -5.398196 0.056891 -0.000047
C  2.484302 -0.718996 -0.000004
C  3.447513 0.349907 -0.000356
C  1.132724 -0.285919 -0.000053
C  3.258949 -1.923137 0.000341
C  -1.239635 -0.833555 0.00029
C  6.000253 0.411402 -0.000406
C  -1.903614 -0.690612 -1.23405
C  -1.904887 -0.695646 1.234503
C  1.83566 1.924935 -0.000891
C  -3.945238 -0.252764 0.000076
C  -3.279818 -0.393702 -1.237462
C  -3.281103 -0.398745 1.237712
H  2.926147 -2.958165 0.000668
H  6.569876 0.119569 0.897019
H  6.568553 0.121656 -0.899367
H  5.835846 1.500037 0.000918
H  -1.349192 -0.811292 -2.168639
H  -1.351403 -0.820187 2.169142
H  -3.839643 -0.270887 -2.167681
H  -3.841885 -0.279724 2.167849
