program: Gaussian 09
title: 000223696
version: EM64L-G09RevD.01
frameworkgroup: C1[X(C7H10N6)]
method: RPBEPBE
basis: SDD
operation: Freq
keyword: #pfreq=noraman
keyword: PBEPBE/SDD
title: #p freq=noraman PBEPBE/SDD
converged: NO YES NO NO
title: Mulliken charges:
elementType: N N N N N N C C C C C C C H H H H H H H H H H
charge: -0.411122 -0.377287 -0.086005 -0.115697 -0.014747 -0.337677 -0.001727 0.121460 0.221184 -0.416018 0.014533 -0.604219 -0.601505 0.251341 0.331700 0.314800 0.322929 0.247790 0.247740 0.205056 0.240378 0.240318 0.206774
chargesum: 0.00000
title: Mulliken charges with hydrogens summed into heavy atoms:
elementType: N N N N N N C C C C C C C
charge: -0.079421 -0.062487 -0.086005 -0.115697 -0.014747 -0.014748 -0.001727 0.121460 0.221184 -0.164677 0.014533 0.096367 0.085965
polarizability: 1.71870437e+02 2.72228862e+00 1.39183838e+02 -1.33684639e-02 -6.69322221e-03 5.74161703e+01
1716.lowfreq: -5.9166 0.0007 0.0008 0.0008 8.1261 9.1551 54.9733 64.5326 83.0919
frequency: 54.9553 64.4396 83.0109 109.3054 141.7772 161.8857 206.5099 224.2645 235.9808 321.1553 337.8374 415.3595 434.3742 470.0623 512.5227 533.6477 588.0404 626.0398 641.5196 662.7433 716.0448 716.2582 779.9276 781.6664 823.9956 903.0226 946.5972 1007.2416 1026.1173 1077.0829 1123.5607 1125.6304 1143.0516 1169.3268 1186.2950 1213.0262 1257.0610 1288.6653 1332.3583 1365.3785 1390.5058 1414.3279 1422.1577 1441.4761 1452.7846 1455.6425 1462.9800 1483.5510 1493.9556 1507.3224 1549.9023 1589.7231 1606.6523 2979.4938 2987.8701 3055.2805 3067.4705 3097.1506 3103.9390 3204.3563 3589.6602 3596.6209 3625.4151
redmass: 1.0371 1.3369 2.1356 3.6478 3.0096 3.5310 3.6501 4.2661 6.0925 4.0681 7.6335 4.7118 1.2072 5.5560 1.1350 8.7148 1.9764 4.1249 1.9112 9.3004 5.7877 8.6930 9.3868 3.8304 1.6556 4.9958 3.2855 4.8383 5.1612 1.7370 1.2818 1.2759 4.3102 1.9172 2.5858 1.6352 4.3331 2.6092 2.5746 6.6679 3.1671 1.7334 1.4719 1.2940 1.0416 1.0417 1.6370 1.4384 1.0896 1.6752 4.4767 6.2669 5.5971 1.0341 1.0337 1.1011 1.1012 1.1005 1.1014 1.0971 1.0773 1.0781 1.0821
irintensity: 0.2717 1.0850 0.1525 7.1882 1.1358 2.7096 1.2734 5.2608 3.7508 1.6204 4.1974 7.1851 96.7558 2.1831 99.2891 1.3636 54.2597 1.7777 75.2787 11.0637 7.9492 3.4460 8.0325 43.6387 15.9875 42.3971 15.3515 5.3068 10.3711 19.8028 1.2006 2.4993 18.4281 3.1201 10.9390 12.7788 4.3345 17.8315 23.9311 25.4172 6.7989 117.6095 26.5360 17.1412 4.9130 21.2465 18.1561 4.2415 4.1073 66.9604 718.8232 229.7627 603.1103 76.8120 70.1872 38.3445 30.7297 34.0949 21.7467 6.8824 70.5269 44.5617 80.5211
temp: 298.150 k
press: 1.00000 atm
elementType: 7 7 7 7 7 7 6 6 6 6 6 6 6 1 1 1 1 1 1 1 1 1 1
symmnumber: 1
zpe: 474833.6 jmol-1
zpe.correction: 0.180855 hartree
zpe.thermalcorrener: 0.193128 hartree
zpe.thermalcorrenthalpy: 0.194072 hartree
zpe.thermalcorrgfe: 0.141803 hartree
zpe.sumelectzpe: -600.304422 hartree
zpe.sumelectthermal: -600.292149 hartree
zpe.sumelectthermalent: -600.291205 hartree
zpe.sumelectthermalfe: -600.343474 hartree
dipole: -2.8430 2.0277 0.0008
dipole: 3.4921
quadrupole: -76.2699 -57.9151 -79.5486
quadrupole: 3.6635 0.0030 -0.0023
quadrupole: -5.0254 13.3295 -8.3041 3.6635 0.0030 -0.0023
hfenergy: -600.4852768 hartree
pointgroup: C01 [X(C7H10N6)]
dipole: -1.0920943 -0.83359 -0.00032 debye
dipolederiv: -0.4251988 0.1775833 0.0002049 -0.2611312 -0.3132191 -0.0002249 0.0003248 0.000386 -0.2799969 -0.3260534 -0.0607102 0.0001482 -0.3360158 -1.5053993 0.0001392 0.0000383 -0.000444 -0.4856616 -1.5070113 0.2487777 -0.0001196 -0.1484208 -0.6377157 0.0001771 -0.0001641 0.0000449 -0.254888 -0.7378815 0.479419 -0.000052 0.485705 -1.2726176 0.0001929 -0.0000582 0.0003668 -0.2370838 -0.6833558 -0.3415732 0.000219 -0.1392065 0.0924772 0.0001285 -0.0004938 -0.000328 -0.2220457 -1.5302899 0.3846158 -0.0002114 0.6767688 -0.5167458 -0.0000592 0.0005505 -0.0003293 -0.5021526 -0.6850487 -0.3367005 -0.0001405 -0.003724 -0.7023378 0.0001228 -0.0000693 0.0001632 -0.0332032 1.0934612 -0.1728039 0.0000731 -0.0944965 0.543403 -0.0001903 0.0002046 -0.0000645 0.0938018 0.9174762 -0.1080269 -0.0000341 0.1934636 1.9595773 -0.0002333 0.0000831 -0.0000594 0.2169464 0.5227221 -0.0026423 -0.0000052 -0.0663721 0.0165798 0.0001307 0.0003157 -0.0002488 -0.1077464 1.9628647 -0.5077013 0.0000615 -0.5976964 1.1784848 -0.0002264 -0.000121 -0.0001912 0.1749914 0.392843 0.2738376 -0.0001951 0.1279012 0.3765742 -0.0000311 -0.0000946 0.0001332 0.2306648 0.65149 0.0029056 0.0001702 0.2090812 0.2014857 0.0001748 -0.0001025 0.0001916 0.2524813 0.0471037 0.0487125 -0.0000325 0.0818101 -0.0209033 -0.0000462 -0.0000545 0.0001357 0.1722484 0.2138598 0.0542083 -0.0001203 0.0650684 0.2285137 0.0000158 -0.0001433 -0.0000087 0.3527453 0.0568645 -0.0762052 -0.000041 -0.0246008 0.1987568 0.0000081 -0.0001134 0.0000979 0.3265533 0.1109334 -0.0496021 0.0000246 -0.1094438 0.1999236 0.0000513 -0.0000321 0.0001563 0.3372711 -0.0255781 -0.0998749 -0.0820296 0.0258692 0.0752281 0.0623693 -0.1066177 -0.0076906 -0.0640291 -0.0256261 -0.1000969 0.0820824 0.025717 0.0751282 -0.062276 0.1067128 0.0078866 -0.0642749 0.0615729 0.0935138 0.0000696 -0.003921 -0.1862742 -0.0000999 0.000053 -0.0001203 0.1232968 -0.0002237 -0.003044 -0.0033781 -0.1468804 0.0347662 0.1104473 0.0798674 0.0933757 -0.0765928 -0.000571 -0.0030343 0.003252 -0.1470197 0.0348806 -0.11045 -0.0801515 -0.0933361 -0.0768628 -0.0843534 0.0984422 0.0000539 0.1875443 -0.0605662 -0.0001205 0.0000657 -0.0001172 0.1235369 unknown
polarizability: 172.0124108|-1.6583273|139.0418635|0.0135783|-0.0062567|57.4161703 unknown
InChI: InChI=1S/C7H10N6/c1-8-5-4-3-10-13-6(4)12-7(9-2)11-5/h3,8-9,13H,1-2H3
charge 0 multiplicity 1
23 atoms
N  2.369071 1.488672 0.000157
N  -0.151756 -2.483638 0.000321
N  -0.076712 1.758122 -0.000493
N  -1.258416 -0.414254 0.000048
N  3.317557 0.452341 0.001198
N  -2.408313 1.634061 -0.000294
C  1.1692 -0.407446 0.00016
C  1.066876 1.02307 -0.000203
C  -0.084815 -1.109671 0.000344
C  2.576802 -0.689916 -0.00028
C  -1.203548 0.966671 -0.000401
C  -1.421773 -3.21756 0.000408
C  -3.710495 0.968481 -0.000318
H  3.0999 -1.645901 -0.000349
H  2.685391 2.455337 0.000257
H  0.724334 -3.002775 0.000572
H  -2.341339 2.651182 -0.000653
H  -2.025316 -2.965034 -0.889613
H  -2.024874 -2.965759 0.89095
H  -1.20767 -4.299387 -0.000093
H  -3.833729 0.32563 0.890313
H  -3.834179 0.326374 -0.891443
H  -4.500994 1.737898 0.000211
