program: Gaussian 09
title: 000223695
version: EM64L-G09RevD.01
frameworkgroup: C1[X(C7H8N4S2)]
method: RPBEPBE
basis: SDD
operation: Freq
keyword: #pfreq=noraman
keyword: PBEPBE/SDD
title: #p freq=noraman PBEPBE/SDD
converged: NO NO NO NO
title: Mulliken charges:
elementType: S S N N N N C C C C C C C H H H H H H H H
charge: 0.243181 0.275108 -0.397611 0.046710 0.055163 0.006382 0.243318 0.104682 -0.334187 -0.405870 -0.411991 -0.819281 -0.824481 0.274897 0.346772 0.249019 0.279112 0.279327 0.245616 0.271957 0.272176
chargesum: 0.00000
title: Mulliken charges with hydrogens summed into heavy atoms:
elementType: S S N N N N C C C C C C C
charge: 0.243181 0.275108 -0.050839 0.046710 0.055163 0.006382 0.243318 0.104682 -0.334187 -0.130973 -0.411991 -0.011824 -0.034732
polarizability: 2.04427539e+02 6.14346653e+00 1.68203483e+02 -2.07191683e-02 5.63686212e-02 6.02176495e+01
1716.lowfreq: -6.9885 0.0011 0.0024 0.0028 7.6165 8.6509 52.5023 69.9646 96.5450
frequency: 52.4766 69.9515 96.5132 107.1314 113.4960 128.5360 153.6337 177.7329 234.1359 234.1660 287.1997 331.7931 368.5432 400.6460 515.9435 580.8962 610.0244 618.8372 650.4904 664.2008 665.1581 669.6914 738.9022 783.8235 811.2305 842.8882 901.5868 965.4723 977.8572 981.3671 993.2213 1000.0853 1025.0441 1144.2639 1215.6273 1231.6376 1275.7180 1306.7942 1340.5870 1349.6767 1356.5201 1387.5128 1410.1998 1433.8384 1438.1891 1445.0311 1456.9913 1517.2335 1570.0529 3019.6889 3024.4959 3140.7087 3148.6952 3151.8157 3155.4300 3230.4891 3619.7266
redmass: 3.1202 4.0635 1.4862 1.9654 3.9639 1.4078 3.2482 4.0232 6.0308 7.0340 5.0060 8.7575 12.9443 9.4103 7.5944 6.2068 9.7022 3.1795 1.6526 7.4324 7.1228 7.0198 10.8657 4.0906 12.2464 1.5894 5.2321 3.3395 1.1779 1.1770 1.2802 1.5010 5.4090 5.4742 1.8323 6.9305 3.9350 4.7766 1.2215 1.1956 3.9775 2.8766 6.6247 1.0531 1.0532 1.0512 1.0559 5.4720 8.5515 1.0284 1.0282 1.1035 1.1042 1.1058 1.1057 1.0981 1.0825
irintensity: 0.1476 5.5605 0.0233 0.0026 0.2854 0.0299 0.0025 3.8651 0.3013 0.2175 4.3506 0.4430 3.9628 1.4582 5.3917 5.0102 5.7147 36.5930 78.7416 2.2080 0.7161 7.2272 6.7761 12.8680 60.5452 22.9188 74.7030 16.8691 1.9452 14.1807 8.7717 4.9160 10.1104 212.9351 16.7065 34.5399 130.9343 90.0972 15.5591 17.5019 60.8384 97.3413 8.3457 0.6513 31.2335 23.8197 36.7074 210.8792 246.7408 20.3647 19.3716 12.3318 6.4361 13.9831 10.7556 1.1950 105.8448
temp: 298.150 k
press: 1.00000 atm
elementType: 16 16 7 7 7 7 6 6 6 6 6 6 6 1 1 1 1 1 1 1 1
symmnumber: 1
zpe: 389525.6 jmol-1
zpe.correction: 0.148362 hartree
zpe.thermalcorrener: 0.161351 hartree
zpe.thermalcorrenthalpy: 0.162296 hartree
zpe.thermalcorrgfe: 0.107732 hartree
zpe.sumelectzpe: -1285.710457 hartree
zpe.sumelectthermal: -1285.697468 hartree
zpe.sumelectthermalent: -1285.696524 hartree
zpe.sumelectthermalfe: -1285.751087 hartree
dipole: 1.9581 2.4262 0.0002
dipole: 3.1178
quadrupole: -88.0802 -85.2156 -92.8896
quadrupole: 8.7877 0.0222 -0.0237
quadrupole: 0.6483 3.5129 -4.1612 8.7877 0.0222 -0.0237
hfenergy: -1285.8588198 hartree
pointgroup: C01 [X(C7H8N4S2)]
dipole: -0.8912331 -0.8333086 -0.1262593 debye
dipolederiv: -0.0276238 -0.0628215 0.0042736 -0.2450014 -0.7686404 -0.0494473 -0.0007276 -0.0272476 -0.080195 -0.6478583 0.2228382 -0.0584878 0.4391465 -0.0540387 0.0490442 -0.0552922 0.0255317 -0.0741915 -0.4378608 0.1520079 -0.0150916 -0.2579063 -0.3534839 -0.0318715 -0.027379 0.0144005 -0.2668701 -1.3032012 0.2430881 -0.1196637 -0.1408604 -0.572128 -0.0282131 -0.1308099 0.0156742 -0.1903033 -0.7572926 0.5769002 -0.0550418 0.5828599 -1.4448237 0.0250234 -0.0560886 0.0254279 -0.1159013 -0.5570931 -0.3060808 -0.0491622 -0.0586428 0.1366885 0.0034471 -0.0416364 -0.0243382 -0.2092221 -0.483419 -0.2236516 -0.0678108 -0.2723836 -0.7728699 -0.0561952 -0.069712 -0.050922 0.0484184 0.8817347 -0.122664 0.0817606 0.244167 0.5729219 0.0411772 0.0932708 -0.0006217 0.133747 0.6908051 -0.0895849 0.0729121 0.2282064 1.7237562 0.0786598 0.0826379 0.0419783 0.0248283 0.3580905 -0.0443885 0.0491533 -0.1096442 0.0398342 -0.0084643 0.04703 -0.0010048 -0.0829641 1.6227411 -0.5055402 0.1692484 -0.6182572 0.9980275 -0.0383129 0.1673642 -0.0264546 0.0071867 0.1521003 0.0926853 0.0145886 0.0906849 0.0701073 0.0111032 0.0140507 0.0105055 0.0556173 0.1751349 0.0733476 0.0156151 0.0649356 0.00503 0.0051264 0.0164403 0.0063332 0.050379 0.0742138 0.025657 -0.0104128 0.0481472 0.0255303 0.0009925 -0.0097621 -0.0016255 0.1727342 0.2315533 0.0594341 -0.0122906 0.0877428 0.2582271 0.0069968 -0.0114475 0.0038042 0.3548698 0.0709137 -0.0303917 -0.0078167 -0.052293 -0.1064332 -0.013412 -0.0085324 -0.0109856 0.1282135 -0.020947 -0.0435755 -0.0626672 0.0394547 0.0943834 0.0897397 -0.0393829 0.0589855 -0.023654 -0.04392 -0.0329024 0.0564316 0.0558943 0.1035492 -0.0712342 0.0385175 -0.0606682 -0.0090739 -0.1049427 0.0748588 -0.0247395 0.0888735 0.0477045 0.0084694 -0.0241419 0.0065751 0.1269833 0.0678844 -0.0376821 -0.0178003 -0.1193438 -0.0060046 0.0942157 -0.0113874 0.0764323 -0.0264006 0.0589868 -0.0215339 0.0370018 -0.0957801 0.0026621 -0.116845 0.0269885 -0.0817801 -0.0242016 unknown
polarizability: 203.5940112|0.3619196|167.1068016|16.2068153|3.2819611|62.147858 unknown
InChI: InChI=1S/C7H8N4S2/c1-12-6-4-3-8-11-5(4)9-7(10-6)13-2/h3,11H,1-2H3
charge 0 multiplicity 1
21 atoms
S  -0.03237 -2.795645 -0.276816
S  -2.536463 2.089596 -0.413276
N  2.545863 1.524894 0.144983
N  0.12094 1.86117 -0.118603
N  -1.096068 -0.256993 -0.319581
N  3.454031 0.45794 0.215573
C  1.301023 -0.335998 -0.051175
C  1.242882 1.100665 -0.014771
C  0.042431 -0.98462 -0.21296
C  2.691466 -0.662697 0.096055
C  -1.007078 1.116285 -0.267945
C  -1.877855 -3.062373 -0.501193
C  -3.820389 0.730592 -0.590891
H  3.174987 -1.637164 0.121231
H  2.890136 2.480338 0.212368
H  -2.011816 -4.154297 -0.550741
H  -2.210358 -2.582674 -1.432094
H  -2.419913 -2.638154 0.355168
H  -4.784338 1.255497 -0.689248
H  -3.816288 0.090089 0.302019
H  -3.611727 0.130253 -1.487302
