program: Gaussian 09
title: 000223692
version: EM64L-G09RevD.01
frameworkgroup: C1[X(C7H8ClN5O)]
method: RPBEPBE
basis: SDD
operation: Freq
keyword: #p
keyword: freq=noraman
keyword: PBEPBE/SDD
title: #p freq=noraman PBEPBE/SDD
converged: NO YES NO NO
title: Mulliken charges:
elementType: Cl O N N N N N C C C C C C C H H H H H H H H
charge: -0.013242 -0.483355 -0.360480 -0.388814 -0.029319 0.053284 0.000355 0.018898 0.249898 -0.351820 0.127294 -0.407077 -0.318708 -0.337195 0.239103 0.266954 0.340554 0.264470 0.207288 0.213958 0.346823 0.361129
chargesum: 0.00000
title: Mulliken charges with hydrogens summed into heavy atoms:
elementType: Cl O N N N N N C C C C C C C
charge: -0.013242 -0.122226 -0.019926 -0.041991 -0.029319 0.053284 0.000355 0.018898 0.249898 0.154237 0.127294 -0.142607 0.102539 -0.337195
polarizability: 1.62138362e+02 3.73916270e-01 1.60267103e+02 -4.69863331e+00 9.44595136e-01 5.95223756e+01
1716.lowfreq: -4.2147 0.0021 0.0024 0.0029 2.6460 7.8763 32.5477 69.4668 91.1009
frequency: 32.4792 69.4516 91.0973 103.5021 148.0024 173.0269 227.0289 239.3004 278.0819 296.7805 341.1388 357.6258 367.8983 469.5291 519.2831 542.3099 606.9471 646.1416 650.5571 662.7377 667.0084 698.7226 745.1770 785.6010 836.0409 839.9089 886.0842 899.7430 924.1786 1026.6214 1031.0354 1037.2335 1080.7802 1120.1363 1157.1182 1189.4214 1209.6661 1221.8885 1264.7137 1280.1756 1331.7762 1347.9978 1370.6100 1378.3861 1397.6038 1401.6953 1432.3823 1468.4225 1473.6989 1499.5251 1558.1730 1606.4785 2967.8070 2991.5450 3032.3965 3097.8263 3217.7029 3546.0007 3598.3760 3619.8076
redmass: 4.4453 5.5725 3.6541 6.9855 5.6245 5.0809 8.0733 6.8260 1.1417 3.9707 7.7760 4.0157 5.8075 3.9635 8.7663 3.3545 3.4406 1.3790 2.1256 5.9591 2.4338 6.0118 7.4501 3.8355 1.6254 2.3087 3.7310 5.6770 3.7145 3.4923 3.7042 3.8816 1.7460 1.8718 5.2964 1.4591 1.1878 1.8410 1.3477 2.6910 2.1833 1.5277 10.2753 3.7984 2.9101 1.6411 1.9675 1.0829 1.0847 3.9073 6.4913 6.6453 1.0558 1.0698 1.1063 1.0955 1.0977 1.0772 1.0669 1.0826
irintensity: 2.1765 2.7661 5.3463 1.0702 5.8031 2.6071 2.1137 3.7166 154.7395 1.3935 4.6222 15.6533 17.4457 26.4207 0.6627 5.5810 38.5599 25.6704 56.1656 0.3677 112.9212 10.4825 5.9286 30.3030 21.6068 3.8883 81.0346 70.8190 47.6882 10.6006 22.0397 39.3383 7.6330 4.0258 141.2338 85.6864 3.7511 32.4844 51.4063 117.8508 51.3010 24.7896 109.0671 96.7967 7.5301 0.5135 19.5470 19.5878 11.1736 1.4210 257.3388 698.8100 62.5327 21.5273 83.5932 6.5634 2.1508 115.2494 8.0409 104.8914
temp: 298.150 k
press: 1.00000 atm
elementType: 17 8 7 7 7 7 7 6 6 6 6 6 6 6 1 1 1 1 1 1 1 1
symmnumber: 1
zpe: 419066.1 jmol-1
zpe.correction: 0.159614 hartree
zpe.thermalcorrener: 0.172048 hartree
zpe.thermalcorrenthalpy: 0.172992 hartree
zpe.thermalcorrgfe: 0.119364 hartree
zpe.sumelectzpe: -1079.545017 hartree
zpe.sumelectthermal: -1079.532583 hartree
zpe.sumelectthermalent: -1079.531639 hartree
zpe.sumelectthermalfe: -1079.585267 hartree
dipole: 5.6652 1.3901 1.1279
dipole: 5.9413
quadrupole: -68.2408 -96.7688 -88.1594
quadrupole: -7.5651 6.1388 0.4340
quadrupole: 16.1488 -12.3791 -3.7697 -7.5651 6.1388 0.4340
hfenergy: -1079.7046311 hartree
pointgroup: C01 [X(C7H8Cl1N5O1)]
dipole: -2.0712192 -1.0424013 0.2954445 debye
dipolederiv: -0.1688031 -0.14955 -0.0237659 -0.2043655 -0.9576831 -0.115741 -0.035469 -0.1188941 -0.1039666 -0.5569063 -0.0724097 -0.2203467 -0.159558 -0.7405132 -0.0450304 -0.2616293 -0.0736645 -0.4089828 -1.7138168 -0.0536447 -0.0748284 -0.3431729 -0.2809038 0.0047188 -0.0363074 0.0136376 -0.4633498 -0.3837719 0.2161866 0.0119948 -0.131681 -0.353113 -0.0283866 -0.0303724 0.0158927 -0.2557449 -1.2613261 -0.3820742 -0.147891 -0.7521204 -0.88726 -0.1411792 -0.2003246 -0.1238564 -0.2253166 -0.7885411 0.3668389 -0.0255636 0.0708483 -1.170405 -0.1006955 -0.0666092 -0.0699573 -0.1688105 -0.0824118 0.2224287 0.0451363 0.4948046 -0.3325391 0.0403014 0.0700019 0.0130509 -0.1988867 -0.8215755 0.0101429 -0.0767424 0.2559843 -0.3393824 -0.0127904 -0.0840917 -0.0340047 -0.0171549 2.1240426 0.0932229 0.1868651 0.6141564 0.6760485 0.0990377 0.3036171 0.069176 0.2547326 0.4876357 -0.1624423 0.065625 -0.4704653 0.1298325 -0.0721375 0.0037578 -0.0318987 0.2609615 0.5746943 -0.2253182 0.0230331 -0.0667482 0.7517448 0.0597 0.0451383 0.0417167 0.1129484 0.0151223 -0.0075742 0.0107918 -0.1067366 0.3301488 0.0416329 0.0042283 0.0470308 -0.0897313 0.3954933 0.1109985 0.1251531 0.2038187 0.6147005 0.0964353 0.0759251 0.0685903 0.3129349 1.4044594 0.0789921 0.1620578 0.3452006 1.9236262 0.2430895 0.212702 0.2286183 0.0588599 -0.0961864 0.0405841 -0.0476918 0.124132 0.0854661 0.0176799 -0.0847026 0.0608511 -0.1209512 0.1453089 -0.0505485 -0.0157485 0.0351556 0.0191463 -0.034098 0.019072 -0.0457449 0.0870028 0.3118166 0.0519755 -0.0344204 0.1884731 0.1459081 -0.0027439 -0.0416587 -0.003772 0.3184633 0.0430811 -0.0653072 -0.0236067 -0.0422009 0.0298058 -0.0202409 -0.0212938 -0.0233652 0.1672831 -0.1865802 0.1207897 -0.0104815 0.079077 -0.0973201 -0.0234539 -0.0352925 -0.0008774 0.0708689 0.0701942 -0.0241282 -0.081492 -0.0512375 -0.0184332 0.0169825 -0.0400987 -0.0349165 -0.188475 0.3087174 -0.0439431 -0.0115139 -0.035087 0.1901998 -0.0226968 -0.0091036 -0.0236261 0.3508683 0.1793537 -0.0752199 0.163436 -0.0482771 0.2809256 -0.000384 0.2125111 0.0260136 0.2464467 unknown
polarizability: 161.639225|0.0183043|159.4779217|7.0717926|10.1270982|60.8106942 unknown
InChI: InChI=1S/C7H8ClN5O/c8-7-11-5(9-1-2-14)4-3-10-13-6(4)12-7/h3,9,13-14H,1-2H2
charge 0 multiplicity 1
22 atoms
Cl 1.494641 3.52096 0.547406
O  -4.310347 -1.156581 -0.037924
N  -1.748485 -0.237833 -0.275421
N  2.777459 -1.450902 0.143383
N  -0.121843 1.422734 0.105389
N  2.267085 0.954082 0.349005
N  2.095351 -2.654013 -0.072297
C  0.616055 -0.879405 -0.054744
C  -0.43948 0.0969 -0.079132
C  -2.857893 0.723862 -0.31245
C  1.93274 -0.36152 0.163324
C  0.785957 -2.298014 -0.190045
C  -4.029488 0.185974 0.512556
C  1.177618 1.743973 0.30313
H  -3.189906 0.877427 -1.35803
H  -2.494397 1.686849 0.079889
H  -2.015018 -1.218609 -0.389454
H  0.046922 -3.077739 -0.367718
H  -4.904573 0.8568 0.398172
H  -3.750126 0.119178 1.583736
H  3.788239 -1.461583 0.262109
H  -5.054311 -1.58284 0.453416
