program: Gaussian 09
title: 000223691
version: EM64L-G09RevD.01
frameworkgroup: C1[X(C7H7ClN4S)]
method: RPBEPBE
basis: SDD
operation: Freq
keyword: #p
keyword: freq=noraman
keyword: PBEPBE/SDD
title: #p freq=noraman PBEPBE/SDD
converged: NO YES NO NO
title: Mulliken charges:
elementType: Cl S N N N N C C C C C C C H H H H H H H
charge: 0.007311 0.246063 -0.387950 0.075897 0.010916 0.074384 0.247700 0.133095 -0.314159 -0.397843 -0.568067 -0.662328 -0.362093 0.278249 0.286019 0.286007 0.352615 0.231117 0.231127 0.231940
chargesum: 0.00000
title: Mulliken charges with hydrogens summed into heavy atoms:
elementType: Cl S N N N N C C C C C C C
charge: 0.007311 0.246063 -0.035335 0.075897 0.010916 0.074384 0.247700 0.133095 -0.314159 -0.119594 0.003958 0.031856 -0.362093
polarizability: 1.82646868e+02 -7.20772277e+00 1.63890424e+02 1.05775711e-02 2.70777783e-03 5.81413715e+01
1716.lowfreq: -6.5891 -2.7526 -0.0014 -0.0006 0.0010 3.8277 32.8032 61.9093 88.0315
frequency: 32.7275 61.8970 88.0305 101.7470 145.1620 214.1643 219.2417 228.7255 236.9088 293.7309 340.1422 367.0054 429.6065 506.3083 581.0915 592.2972 624.6408 627.4281 655.3702 668.0920 731.0836 773.4484 783.8285 816.7091 846.3346 902.1598 971.1715 994.2412 1026.4530 1043.5604 1070.4876 1132.5255 1211.9280 1231.5908 1234.5958 1276.4193 1279.6667 1329.6152 1355.7128 1385.4961 1400.9473 1410.3891 1445.5970 1472.6681 1482.0018 1518.0987 1559.9226 2990.9984 3054.0559 3085.5974 3089.6777 3134.8964 3233.1678 3618.0659
redmass: 2.9882 2.3218 4.5621 7.6684 9.6189 6.8139 7.4529 4.0382 1.3252 4.3341 8.7340 17.1619 10.5227 7.5067 7.6524 8.0434 3.8093 6.0148 1.5645 5.4139 10.9228 1.1225 4.1643 12.6047 1.5577 5.3611 5.5337 1.7907 5.3693 1.2143 2.2802 5.9890 1.8802 1.2291 4.4925 3.8222 1.3518 5.2170 5.8010 3.0885 1.2123 6.6278 1.0874 1.0389 1.0479 5.3084 8.6600 1.0358 1.0598 1.0970 1.1014 1.1083 1.0983 1.0827
irintensity: 0.1680 2.4908 1.3601 0.0251 0.0042 1.8600 0.2706 0.0159 0.0875 1.0491 0.3409 7.5124 4.7884 2.1973 1.9009 17.1902 25.9393 2.4125 85.6864 14.4966 11.9591 9.8701 9.8713 100.7466 24.8090 78.8485 18.7506 24.8392 11.7473 0.5361 7.6359 209.4082 7.9374 0.4189 81.1336 112.2031 22.8735 95.0581 76.8418 110.2351 17.7862 10.8263 10.0407 16.3780 9.6117 259.6452 149.8876 29.1481 2.8793 19.9013 15.4001 16.9541 0.7784 117.1461
temp: 298.150 k
press: 1.00000 atm
elementType: 17 16 7 7 7 7 6 6 6 6 6 6 6 1 1 1 1 1 1 1
symmnumber: 1
zpe: 364307.3 jmol-1
zpe.correction: 0.138757 hartree
zpe.thermalcorrener: 0.150828 hartree
zpe.thermalcorrenthalpy: 0.151772 hartree
zpe.thermalcorrgfe: 0.098643 hartree
zpe.sumelectzpe: -1347.114663 hartree
zpe.sumelectthermal: -1347.102592 hartree
zpe.sumelectthermalent: -1347.101648 hartree
zpe.sumelectthermalfe: -1347.154777 hartree
dipole: -1.9860 -1.4553 0.0009
dipole: 2.4621
quadrupole: -74.8333 -99.7913 -90.5561
quadrupole: -1.6923 0.0050 0.0074
quadrupole: 13.5602 -11.3977 -2.1625 -1.6923 0.0050 0.0074
hfenergy: -1347.2534199 hartree
pointgroup: C01 [X(C7H7Cl1N4S1)]
dipole: -0.6711521 -0.6984915 0.000132 debye
dipolederiv: -0.1268174 0.1407433 0.0002136 0.0718944 -0.9609373 -0.0011377 0.0006227 -0.0038833 -0.0687431 -0.8379842 -0.2100159 0.0000157 -0.4022223 -0.1754346 -0.0000421 -0.0001614 0.000145 -0.0809216 -0.453992 0.2061198 -0.0001168 -0.151659 -0.3569112 -0.0002894 -0.0005222 0.0006817 -0.2539853 -0.8222127 0.3791507 0.0012386 -0.0091275 -0.8575717 -0.0003879 -0.0003628 -0.0012695 -0.1492194 -0.3190249 0.209457 0.0001589 0.4599193 -0.0011117 0.0003429 0.0000186 -0.0000142 -0.2005668 -0.730206 -0.4045593 -0.0006532 -0.6574127 -1.4077157 -0.0005673 0.0013058 -0.000485 -0.1081801 -0.9467352 -0.0711437 -0.0000647 -0.2093184 -0.2538988 0.0000325 -0.0001357 0.0004012 0.0740885 0.785809 -0.327341 0.0002378 0.1183023 0.466342 -0.0003527 0.0004477 -0.0003963 0.116508 1.4515862 0.3239931 -0.0001457 0.8753991 0.8979768 -0.0002705 0.0000651 -0.0002016 0.0104944 0.0816928 -0.0866388 -0.0000742 -0.1652815 0.2614 -0.0000151 0.0000226 -0.0003592 -0.082078 0.5911936 -0.0961752 0.0000587 -0.2665842 0.0604507 -0.0000088 0.0002429 -0.0000204 0.1337821 -0.1620153 -0.053967 0.000054 0.1491105 0.0537331 0.000015 -0.0000273 0.0000305 0.0702137 1.0360776 -0.0524663 -0.0008 0.1138571 2.0255737 0.0026509 -0.0015702 0.0053036 0.0247317 0.0867779 -0.0379852 -0.0000272 -0.0206946 0.0299478 0.0000054 0.0000239 0.0000819 0.1736058 -0.0366163 -0.0079399 -0.0266306 0.0624563 0.0019922 -0.077461 -0.0395722 -0.0689987 -0.0124824 -0.0365401 -0.0078908 0.0266253 0.0624738 0.0021012 0.0774686 0.0394935 0.0690179 -0.0126385 0.3324073 0.003459 -0.0000303 0.024138 0.1766092 0.0000358 0.0001006 0.0000037 0.3577867 0.1167856 0.0075499 0.0103685 -0.0776306 0.0166745 -0.1092543 -0.0378755 -0.1100071 -0.0590767 0.1167869 0.0075728 -0.0104109 -0.0775581 0.0168629 0.1091957 0.0378901 0.1099358 -0.0592717 -0.1269727 0.0780775 -0.0000175 0.099938 0.003917 0.00004 -0.0000062 0.0000341 0.1259528 unknown
polarizability: 184.5353709|-3.6004497|162.0019078|0.0088592|0.0365448|58.1413841 unknown
InChI: InChI=1S/C7H7ClN4S/c1-2-13-6-4-3-9-12-5(4)10-7(8)11-6/h3,12H,2H2,1H3
charge 0 multiplicity 1
20 atoms
Cl 0.014767 3.624467 0.003044
S  -2.022511 -1.386494 0.00013
N  2.968399 -0.594721 0.000838
N  1.641663 1.484658 -0.001073
N  2.74232 -1.977372 0.000659
N  -0.763331 1.050333 -0.001287
C  0.732592 -0.84204 -0.000371
C  1.795817 0.126982 -0.00042
C  -0.586676 -0.299831 -0.000362
C  1.389057 -2.118639 -0.000203
C  -3.441039 -0.112321 -0.000189
C  -4.774006 -0.869634 0.000365
C  0.344462 1.84058 -0.003102
H  0.958441 -3.117794 -0.000134
H  -3.304467 0.516013 0.892882
H  -3.304769 0.515223 -0.893861
H  3.923792 -0.243149 0.001475
H  -4.884667 -1.506122 -0.89504
H  -4.884369 -1.505334 0.896366
H  -5.603876 -0.139603 0.000184
