program: Gaussian 09
title: 000223683
version: EM64L-G09RevD.01
frameworkgroup: C1[X(C17H26O3)]
method: RPBEPBE
basis: SDD
operation: Freq
keyword: #pfreq=noraman
keyword: PBEPBE/SDD
title: #p freq=noraman PBEPBE/SDD
converged: YES YES NO NO
title: Mulliken charges:
elementType: O O O C C C C C C C C C C C C C C C C C H H H H H H H H H H H H H H H H H H H H H H H H H H
charge: -0.289982 -0.271211 -0.290077 0.328597 -0.432500 -0.093687 -0.370530 -0.372901 -0.751069 -0.285271 -0.351696 -0.357678 -0.696074 0.262234 0.304531 -0.351628 -0.389587 -0.798345 -0.244447 -0.246201 0.238984 0.222248 0.211516 0.232898 0.225824 0.195704 0.218542 0.218940 0.232549 0.238284 0.237625 0.198956 0.189384 0.190320 0.197456 0.194858 0.209223 0.215457 0.210062 0.247394 0.231817 0.241525 0.229047 0.218257 0.224478 0.226176
chargesum: 0.00000
title: Mulliken charges with hydrogens summed into heavy atoms:
elementType: O O O C C C C C C C C C C C C C C C C C
charge: -0.289982 -0.271211 -0.290077 0.328597 0.028732 0.117829 0.088192 0.041345 -0.061297 0.151311 0.028007 0.034636 -0.061332 0.262234 0.304531 -0.104233 -0.157771 -0.109517 -0.019969 -0.020025
polarizability: 2.33748942e+02 5.54387425e+00 2.08946619e+02 -5.97932826e+00 1.12832577e+00 1.33153734e+02
1716.lowfreq: -6.6775 -4.3809 -0.0007 -0.0002 0.0002 6.2714 18.2381 22.2433 36.2720
frequency: 18.2331 22.1844 36.1831 47.5860 55.7443 82.3312 89.4764 113.7315 123.4551 132.4098 142.7655 164.8455 177.9470 178.9243 204.4825 221.4127 232.1804 264.7998 266.8456 276.0671 290.3831 335.6854 355.6355 399.3682 443.2227 462.1460 471.0492 474.6650 507.2697 541.9309 565.8374 609.6320 639.0983 646.7045 715.7295 727.8296 737.7442 746.6124 755.3328 764.6962 771.6407 812.0854 835.8194 844.1932 846.8785 886.8308 901.4861 927.5084 932.7383 943.9443 948.9797 972.4093 984.3867 987.5967 1005.4132 1037.4704 1046.7058 1049.8138 1056.1217 1060.1771 1061.8079 1070.2977 1092.4558 1115.8356 1122.2719 1123.8249 1172.7248 1180.8781 1190.9136 1193.6942 1204.1942 1227.0151 1232.4303 1234.2437 1243.8290 1279.1558 1285.6397 1286.4273 1295.0504 1307.3552 1308.4847 1317.2799 1346.9034 1351.1265 1356.0756 1376.7334 1388.0363 1388.8932 1389.2184 1399.3497 1430.0767 1452.6667 1457.5063 1458.3194 1463.3304 1464.5620 1467.7103 1470.6918 1477.4565 1478.1244 1481.0957 1486.0933 1488.9393 1491.4454 1597.5412 1608.5437 2948.5326 2950.8625 2965.1669 2970.7888 2971.6814 2978.1232 2978.2108 2988.6956 2991.7535 3006.4392 3015.5695 3017.4474 3025.0991 3031.6932 3054.8273 3057.5106 3067.4080 3070.0797 3088.8977 3101.1992 3107.1420 3116.5960 3122.7687 3134.3430 3155.5107 3169.2897
redmass: 4.5171 3.5934 4.0107 3.4129 1.6240 3.8610 3.7389 2.6572 2.6549 1.7575 1.1829 3.6452 2.4330 1.4791 2.7377 2.7624 1.1187 3.9406 3.5833 2.7872 3.2554 2.4150 3.1434 2.6490 2.8789 3.6957 3.8226 4.3759 3.5399 3.4793 5.5670 3.4698 5.3619 4.4776 2.4589 1.1082 3.9513 1.7485 1.4426 1.9874 3.4453 4.7279 1.4523 1.6709 2.0515 1.9894 2.2332 1.3847 2.1815 1.8160 1.6538 1.3129 1.6106 4.8053 3.7035 1.4536 1.5273 2.0891 2.3787 2.7481 2.1123 2.2137 1.9447 1.9642 2.4437 2.2372 1.1354 1.9327 2.2101 1.2906 1.8657 1.1715 2.7511 1.6509 1.3278 1.4242 1.0628 1.4110 1.3266 1.1782 1.3770 1.3988 1.5266 1.6316 1.6127 1.7250 1.2983 1.2365 2.3674 1.3594 1.9670 1.0632 1.1360 1.0547 1.0652 1.0670 1.0573 1.0733 1.0526 1.1866 1.0868 1.2013 1.2309 1.5458 6.8345 6.2093 1.0588 1.0609 1.0591 1.0386 1.0573 1.0512 1.0682 1.0945 1.0637 1.0361 1.0975 1.0642 1.1021 1.1021 1.0972 1.1019 1.1007 1.0992 1.0996 1.1050 1.0995 1.1004 1.0867 1.0892 1.0939 1.0988
irintensity: 0.2564 0.0527 0.1293 0.0550 0.0139 0.3067 1.5070 0.6195 0.4564 0.0154 1.1610 2.3882 4.2826 0.3473 2.7824 5.1232 0.0771 2.1771 1.0694 4.7450 3.6692 1.1571 0.9934 2.1292 4.3874 1.6860 7.8607 2.6370 7.4412 0.2472 0.2920 1.4546 7.4282 1.2912 8.0460 6.6727 10.9167 5.7770 84.0447 11.6849 35.5538 27.9261 7.0457 14.7286 14.7250 5.9629 16.4556 1.9437 13.7318 22.6912 18.3906 0.0530 10.3627 75.9282 15.7865 6.8958 7.0858 21.1944 13.9853 13.2321 40.4891 2.0072 9.0407 44.9898 25.4485 40.5572 11.0442 34.2561 61.5863 3.7079 35.9760 3.7772 102.4579 62.5879 6.2592 8.7529 0.6480 0.1897 5.3000 8.5372 3.2180 22.4946 2.1160 0.7144 2.6621 6.3364 46.7998 6.9197 15.4798 15.2138 20.8049 4.3538 39.4002 14.2739 2.2273 2.3947 11.9379 3.5336 14.5143 12.2501 3.4780 28.8614 0.7893 74.8615 12.5303 30.7492 16.9973 15.7136 12.8718 58.6426 60.5690 81.9975 34.6427 4.0520 23.0995 12.4927 0.9895 30.5955 26.8392 25.4709 33.5545 28.7114 103.6857 58.2002 25.1124 28.2485 17.2775 23.4583 6.8166 13.8756 35.7926 14.6492
temp: 298.150 k
press: 1.00000 atm
elementType: 8 8 8 6 6 6 6 6 6 6 6 6 6 6 6 6 6 6 6 6 1 1 1 1 1 1 1 1 1 1 1 1 1 1 1 1 1 1 1 1 1 1 1 1 1 1
symmnumber: 1
zpe: 1036541.8 jmol-1
zpe.correction: 0.394798 hartree
zpe.thermalcorrener: 0.416582 hartree
zpe.thermalcorrenthalpy: 0.417527 hartree
zpe.thermalcorrgfe: 0.341907 hartree
zpe.sumelectzpe: -887.498144 hartree
zpe.sumelectthermal: -887.476359 hartree
zpe.sumelectthermalent: -887.475415 hartree
zpe.sumelectthermalfe: -887.551034 hartree
dipole: 1.1805 -0.2747 0.5567
dipole: 1.3338
quadrupole: -117.1985 -115.9216 -125.2044
quadrupole: -6.5607 2.9265 -1.7759
quadrupole: 2.2430 3.5199 -5.7629 -6.5607 2.9265 -1.7759
hfenergy: -887.8929417 hartree
pointgroup: C01 [X(C17H26O3)]
dipole: 0.4770019 -0.0641976 0.2090846 debye
polarizability: 232.3498129|7.1364344|209.911695|-8.8530332|-2.1251525|133.5877875 unknown
InChI: InChI=1S/C17H26O3/c1-4-5-8-11-17(3)19-13-15(20-17)12-18-16-10-7-6-9-14(16)2/h6-7,9-10,15H,4-5,8,11-13H2,1-3H3
charge 0 multiplicity 1
46 atoms
O  -0.646341 -2.582032 -0.710933
O  -1.960673 -2.387629 1.236907
O  1.349902 -0.488048 0.25494
C  -1.995837 -2.148537 -0.224959
C  -2.16629 -0.650182 -0.549553
C  0.267698 -2.676531 0.450843
C  -0.565821 -2.150884 1.650931
C  -3.493786 -0.037421 -0.050657
C  -3.053022 -3.073051 -0.819105
C  1.577004 -1.935099 0.174346
C  -3.538903 1.496617 -0.232254
C  -4.862611 2.127561 0.256414
C  -4.897443 3.6621 0.089883
C  2.443601 0.3603 -0.016597
C  2.162465 1.755895 0.069674
C  3.736857 -0.108659 -0.34952
C  3.220601 2.656391 -0.18584
C  0.768788 2.236879 0.418589
C  4.773103 0.82024 -0.601532
C  4.520461 2.204972 -0.52048
H  -1.308619 -0.107789 -0.108677
H  -2.077254 -0.532772 -1.647308
H  0.519309 -3.748812 0.586247
H  -0.375043 -1.076461 1.824728
H  -0.406748 -2.723826 2.577496
H  -4.350503 -0.489011 -0.590921
H  -3.625258 -0.288291 1.020843
H  -3.104562 -2.939612 -1.913012
H  -4.042913 -2.853436 -0.38576
H  -2.792587 -4.12018 -0.597295
H  1.938717 -2.208557 -0.836408
H  2.339955 -2.236585 0.924134
H  -3.386361 1.749808 -1.302782
H  -2.691421 1.95669 0.319119
H  -5.016805 1.865822 1.323205
H  -5.70883 1.674249 -0.299376
H  -4.079517 4.141114 0.660916
H  -5.853162 4.087651 0.447628
H  -4.776377 3.948894 -0.971987
H  3.94995 -1.179273 -0.416368
H  3.018377 3.732389 -0.122501
H  0.03421 1.913445 -0.342438
H  0.42809 1.816713 1.383237
H  0.736567 3.337584 0.486017
H  5.772787 0.454106 -0.860454
H  5.320547 2.92696 -0.714584
