program: Gaussian 09
title: 000223677
version: EM64L-G09RevD.01
frameworkgroup: C1[X(C6H7N3O3)]
method: RPBEPBE
basis: SDD
operation: Freq
keyword: #pfreq=noraman
keyword: PBEPBE/SDD
title: #p freq=noraman PBEPBE/SDD
converged: YES YES NO NO
title: Mulliken charges:
elementType: O O O N N N C C C C C C H H H H H H H
charge: -0.252436 -0.316522 -0.325228 -0.320513 -0.325930 -0.635631 0.211097 0.208447 -0.340636 -0.250216 -0.146308 0.308325 0.282773 0.372451 0.259380 0.265941 0.343717 0.347148 0.314140
chargesum: 0.00000
title: Mulliken charges with hydrogens summed into heavy atoms:
elementType: O O O N N N C C C C C C
charge: -0.252436 -0.316522 -0.325228 0.051938 0.017787 0.025657 0.211097 0.208447 -0.057863 0.009164 0.119634 0.308325
polarizability: 1.73128932e+02 1.25748733e+00 1.02128142e+02 -6.32706720e-03 6.24532238e-03 3.99064092e+01
1716.lowfreq: -0.0008 0.0006 0.0007 2.8847 3.6386 7.3601 45.4360 67.1631 73.3862
frequency: 45.4317 67.1562 73.3856 92.6607 165.4360 182.8795 264.2025 268.8214 326.8972 330.0953 444.4523 463.4358 505.9977 540.3987 585.8442 592.2300 627.1851 640.4555 696.5033 718.5942 738.3256 801.9795 836.8822 869.5085 890.0130 896.3641 963.5139 1005.9715 1036.8022 1048.7895 1091.0902 1136.6478 1192.7987 1229.2632 1249.2867 1319.6171 1359.0323 1434.3229 1477.7145 1531.1301 1557.3525 1590.0650 1603.3961 1644.8684 3227.8390 3247.2958 3269.6309 3496.5945 3509.4794 3550.6994 3705.1168
redmass: 5.6856 4.7075 6.3067 7.3158 4.8291 5.6774 9.2408 3.6843 1.4184 5.3439 6.4339 1.1170 3.7329 1.3281 3.1358 3.4088 1.2468 6.1191 6.5159 3.8932 1.2696 7.0786 1.3281 6.5518 4.3594 1.3875 2.2857 1.5592 2.9846 2.5449 2.8886 1.7057 2.3672 2.3320 1.5523 2.2179 2.5814 3.9203 4.7967 3.5406 5.5354 3.2020 2.0400 2.9644 1.0915 1.0995 1.1090 1.0796 1.0793 1.0460 1.1045
irintensity: 0.0425 13.6605 7.0177 10.3206 1.6581 34.1311 0.1114 2.8837 13.2934 3.3269 1.4946 266.9922 33.0131 125.0663 37.2913 69.4564 104.2299 0.9145 48.8118 3.2961 98.0935 11.3146 23.1586 7.7403 13.2281 1.1146 5.9374 43.3592 6.5547 1.5897 6.0079 12.0601 17.9735 12.2700 8.0791 11.0231 0.5076 766.5381 204.0912 326.5410 145.6609 54.5733 151.6738 186.6293 2.9670 1.3715 0.0412 1.0052 202.6509 74.6668 49.7787
temp: 298.150 k
press: 1.00000 atm
elementType: 8 8 8 7 7 7 6 6 6 6 6 6 1 1 1 1 1 1 1
symmnumber: 1
zpe: 359737.7 jmol-1
zpe.correction: 0.137017 hartree
zpe.thermalcorrener: 0.148404 hartree
zpe.thermalcorrenthalpy: 0.149348 hartree
zpe.thermalcorrgfe: 0.098653 hartree
zpe.sumelectzpe: -621.863411 hartree
zpe.sumelectthermal: -621.852023 hartree
zpe.sumelectthermalent: -621.851079 hartree
zpe.sumelectthermalfe: -621.901775 hartree
dipole: 0.2355 0.6025 -0.0040
dipole: 0.6469
quadrupole: -37.5666 -75.2000 -72.9620
quadrupole: 14.1636 -0.0490 0.0109
quadrupole: 24.3429 -13.2905 -11.0525 14.1636 -0.0490 0.0109
hfenergy: -622.0004274 hartree
pointgroup: C01 [X(C6H7N3O3)]
dipole: -0.0883548 -0.2385686 -0.0072954 debye
dipolederiv: -0.5251301 0.2102494 0.0143954 0.1645219 -0.4131241 -0.0122696 0.0132984 -0.0129043 -0.1212843 -0.6263863 -0.200979 -0.0016163 0.2230822 -1.05759 -0.026287 0.0119977 -0.0169874 -0.3895927 -0.7325876 -0.0770528 0.0040959 0.31165 -1.1047636 -0.0283091 0.0154491 -0.0200757 -0.4073339 -0.2728625 0.2345641 0.0072149 0.7684025 -0.5767741 -0.0260064 0.0242456 -0.0152888 -0.2692127 -1.4961196 0.3487313 0.0346334 0.7297369 -0.5203337 -0.0215455 0.0462248 -0.0134069 -0.3521019 -1.564811 -0.2282629 0.0098575 -0.4180919 -0.3696429 0.0237341 0.0062754 0.0197456 -0.7809387 -0.2672579 -0.328413 -0.005144 -0.2006736 0.1852723 0.0097611 -0.0013978 0.012356 -0.0103934 1.4774262 0.024878 -0.0243136 -0.365083 1.3254814 0.0426767 -0.0362899 0.0341374 0.2509771 0.0796364 0.1366317 -0.0003859 0.1149118 0.0525055 0.0040191 -0.0010768 0.0035802 -0.1504245 0.0348031 0.0264886 -0.0038414 -0.1473217 -0.1857093 0.0036809 -0.0091165 0.0000492 -0.2042603 0.0569536 -0.176479 -0.0084069 -0.1768804 0.1441113 0.0116984 -0.0088672 0.0114483 -0.1147916 2.6362385 -0.0511546 -0.0486212 -0.6989676 1.5868721 0.0526729 -0.0675593 0.039363 0.3615193 0.1496503 -0.0029223 0.0008511 -0.0007785 0.0278409 -0.0052458 0.0008921 -0.005223 0.1977564 0.3128127 0.0325998 0.0022684 -0.190278 0.2529568 0.0005537 -0.0049793 -0.0038759 0.3660674 -0.0398174 -0.013021 0.0042948 -0.0100092 0.1310669 -0.001992 0.0043776 -0.0019272 0.2010835 0.0850718 -0.006252 0.0024363 -0.023283 0.0243436 -0.0056757 0.0018845 -0.0059995 0.2206318 0.2253513 0.0699914 0.0053305 -0.0738407 0.2094251 -0.0034082 0.0004793 -0.006298 0.3789921 0.2637567 -0.0084788 0.0022566 -0.047502 0.1738066 -0.0065881 0.0000353 -0.0073289 0.4064382 0.2032718 0.008881 0.0046946 0.0404043 0.114255 -0.0114692 0.0041271 -0.0113641 0.4168682 unknown
polarizability: 173.0038431|2.6307215|102.1386589|-2.6475808|1.9096604|40.0209813 unknown
InChI: InChI=1S/C6H7N3O3/c7-6(11)9-8-5(10)4-2-1-3-12-4/h1-3,8-9H,7H2
charge 0 multiplicity 1
19 atoms
O  1.693638 1.145471 0.042332
O  0.06672 -2.146984 -0.028054
O  -2.955198 1.604495 0.154127
N  -0.791445 -0.000193 0.058593
N  -2.08114 -0.540029 0.068999
N  -4.408908 -0.238974 0.126459
C  1.600477 -0.269181 0.000801
C  0.26641 -0.880806 0.008319
C  2.874423 -0.81688 -0.041568
C  3.810063 0.284263 -0.025547
C  3.064095 1.45155 0.025475
C  -3.151389 0.347518 0.118895
H  3.095982 -1.880697 -0.079046
H  -0.750412 1.024727 0.088155
H  4.895682 0.218059 -0.048731
H  3.309702 2.509426 0.053715
H  -2.083435 -1.564488 0.039668
H  -5.2070 0.389302 0.16157
H  -4.564466 -1.243779 0.093437
