program: Gaussian 09
title: 000223671
version: EM64L-G09RevD.01
frameworkgroup: C1[X(C18H14ClNO3)]
method: RPBEPBE
basis: SDD
operation: Freq
keyword: #p
keyword: freq=noraman
keyword: PBEPBE/SDD
title: #p freq=noraman PBEPBE/SDD
converged: YES YES NO NO
title: Mulliken charges:
elementType: Cl O O O N C C C C C C C C C C C C C C C C C C H H H H H H H H H H H H H H
charge: -0.037251 -0.220487 -0.403692 -0.205554 -0.004697 -0.291750 -0.592961 -0.222998 0.519944 0.145715 -0.440192 -0.377614 0.163108 0.308257 -0.174430 -0.224232 -0.250510 -0.239914 -0.325086 -0.338097 -0.226236 -0.217948 -0.102145 0.276444 0.285554 0.258042 0.307768 0.241837 0.242377 0.229108 0.230039 0.231700 0.258524 0.282884 0.261964 0.262158 0.390372
chargesum: 0.00000
title: Mulliken charges with hydrogens summed into heavy atoms:
elementType: Cl O O O N C C C C C C C C C C C C C C C C C C
charge: -0.037251 -0.220487 -0.013319 -0.205554 -0.004697 -0.015305 -0.049365 0.084770 0.519944 0.145715 -0.198356 -0.135237 0.163108 0.308257 -0.174430 0.004876 -0.020471 -0.008214 -0.066562 -0.055213 0.035728 0.044210 -0.102145
polarizability: 2.53567475e+02 -1.35216064e+01 1.90215889e+02 2.27895293e+01 -1.44133586e+01 1.95243710e+02
1716.lowfreq: -6.1784 -1.4143 -0.0015 -0.0002 0.0007 3.1733 14.5118 26.0003 31.0496
frequency: 14.4707 25.9982 31.0277 34.8513 42.9431 57.6632 58.9546 77.5366 89.1559 120.0156 134.7842 166.8284 193.5319 220.7038 224.4362 252.8731 265.4626 296.3851 322.8218 369.2597 379.4018 403.7358 406.4083 446.9508 453.0420 462.9315 505.8985 527.4951 538.7675 574.4448 612.6635 616.7410 621.8360 631.6753 648.7858 686.5313 705.7795 717.4167 722.8341 767.4289 783.0294 808.6198 828.0104 846.4680 851.9739 853.3921 910.9583 927.1709 956.9574 973.1436 977.5680 983.8995 991.3549 994.2380 998.4132 998.9967 1012.0441 1028.4687 1059.1509 1069.3343 1073.4016 1091.6403 1111.7743 1174.2843 1175.3343 1185.2921 1195.5307 1208.1528 1215.3961 1222.7241 1239.3573 1289.6557 1296.2240 1313.0869 1338.9258 1348.2708 1360.5020 1373.2721 1389.5693 1399.5566 1443.6655 1446.2920 1476.3834 1483.8607 1562.2159 1588.9178 1593.6034 1603.2759 1612.4088 1660.5432 2202.1289 2970.1262 3020.2092 3047.3519 3050.0403 3124.7321 3128.9784 3140.2410 3150.1864 3152.6300 3156.0561 3166.0013 3174.5446 3177.9516 3511.2194
redmass: 8.3804 4.4032 6.1657 5.2239 9.3970 6.7855 8.2715 6.2655 10.5537 10.2509 8.1709 6.0471 5.8707 4.4332 6.2992 5.5007 5.5131 5.7910 6.0377 6.2913 7.3081 2.8165 2.8802 6.0889 4.4339 4.1639 7.2096 3.7201 2.9111 2.6143 4.7108 2.1117 7.1315 4.9592 4.0373 3.7602 1.7914 3.5572 5.1465 2.0596 3.5568 4.8049 1.4154 1.4070 2.1713 1.7130 3.1030 1.5677 1.7512 2.0726 1.4250 3.5107 3.4023 1.8497 1.6341 2.5046 3.8444 2.2224 2.3979 2.4859 2.9821 1.7969 1.3667 1.0576 1.3773 1.1398 1.1189 1.9728 1.1894 1.3518 2.2050 1.5405 1.2925 1.5168 1.7415 1.7266 1.7336 4.7364 3.5709 3.9721 1.1753 1.9068 2.2700 2.2638 7.8515 6.8033 5.8576 7.4536 6.0701 8.7942 12.5650 1.0654 1.0843 1.0929 1.0834 1.0848 1.0877 1.0920 1.0964 1.0888 1.0888 1.1016 1.0963 1.0975 1.0642
irintensity: 0.2708 1.1808 1.2521 1.9110 1.5437 0.7462 0.7405 1.5826 2.5895 5.3480 1.9922 1.1771 2.5154 2.2925 2.7070 1.2434 1.0119 0.2293 3.4406 11.1829 1.6710 0.1804 0.1209 17.0366 2.9671 9.3431 25.4170 24.2114 23.3808 10.6275 9.7099 82.3183 1.1419 30.4234 42.6547 47.9219 61.6163 2.2345 13.0417 25.1511 17.5363 20.0834 22.7441 34.7993 2.5542 3.1131 1.8367 1.2984 3.3757 21.5427 0.3839 120.4395 5.4919 8.3891 7.4847 10.6371 46.5383 8.1402 167.1430 107.7324 22.6815 8.5195 10.1708 0.6488 10.5447 28.4213 1.1330 16.2005 0.8402 9.6679 161.1980 60.0303 6.2250 54.1267 45.0451 42.3395 5.0732 26.3299 0.5005 26.9048 21.0539 21.6578 9.9605 14.5336 109.9144 130.2759 1.5078 34.0208 3.7499 210.1769 4.9732 29.3255 5.8492 5.8308 0.5844 3.5263 0.1317 17.1502 28.0766 4.8073 0.1918 20.3971 4.5380 1.4483 44.5981
temp: 298.150 k
press: 1.00000 atm
elementType: 17 8 8 8 7 6 6 6 6 6 6 6 6 6 6 6 6 6 6 6 6 6 6 1 1 1 1 1 1 1 1 1 1 1 1 1 1
symmnumber: 1
zpe: 717335.8 jmol-1
zpe.correction: 0.273219 hartree
zpe.thermalcorrener: 0.294396 hartree
zpe.thermalcorrenthalpy: 0.295340 hartree
zpe.thermalcorrgfe: 0.218660 hartree
zpe.sumelectzpe: -1433.171548 hartree
zpe.sumelectthermal: -1433.150370 hartree
zpe.sumelectthermalent: -1433.149426 hartree
zpe.sumelectthermalfe: -1433.226107 hartree
dipole: -1.0698 0.8273 -2.1958
dipole: 2.5789
quadrupole: -139.5411 -135.1583 -143.5245
quadrupole: -0.3941 10.1933 9.7998
quadrupole: -0.1331 4.2497 -4.1166 -0.3941 10.1933 9.7998
hfenergy: -1433.4447665 hartree
pointgroup: C01 [X(C18H14Cl1N1O3)]
dipole: 0.3786259 -0.4582245 -0.8222471 debye
polarizability: 248.3057207|-24.7723106|199.0520763|-17.1874809|17.114503|191.6692771 unknown
InChI: InChI=1S/C18H14ClNO3/c19-14-8-6-13(7-9-14)17(21)10-15(16(11-20)18(22)23)12-4-2-1-3-5-12/h1-9,15-16,22H,10H2
charge 0 multiplicity 1
37 atoms
Cl -6.838758 1.141449 0.294394
O  -0.618852 -0.413509 -2.070554
O  3.743515 2.209868 -1.662097
O  2.039412 3.323817 -0.53635
N  2.43351 1.587486 2.7572
C  1.560514 0.109403 -0.3973
C  0.167475 0.674711 -0.034181
C  2.72491 1.035698 0.165287
C  1.760118 -1.345829 0.035337
C  -0.922672 0.175642 -0.990672
C  2.119513 -2.31608 -0.933578
C  1.604806 -1.754712 1.386192
C  2.776568 2.325426 -0.662716
C  -2.358094 0.428408 -0.636371
C  2.568222 1.350071 1.596645
C  2.326422 -3.664182 -0.565076
C  1.813617 -3.101516 1.756525
C  2.176008 -4.061049 0.783219
C  -2.74556 1.186118 0.502175
C  -3.366144 -0.104176 -1.486258
C  -4.108126 1.409723 0.789116
C  -4.730025 0.104837 -1.210656
C  -5.079752 0.862218 -0.072359
H  1.657289 0.139577 -1.49885
H  0.176234 1.784198 -0.081074
H  -0.098633 0.414742 1.006429
H  3.678891 0.49904 0.019781
H  2.218496 -2.014947 -1.98292
H  1.327286 -1.028473 2.15893
H  2.596956 -4.402346 -1.328152
H  1.693771 -3.401026 2.803604
H  2.335053 -5.105918 1.07201
H  -1.993604 1.616993 1.170395
H  -3.053319 -0.68219 -2.361724
H  -4.409579 1.995828 1.661631
H  -5.506592 -0.307992 -1.860555
H  3.734025 3.02259 -2.238122
