program: Gaussian 09
title: 000223664
version: EM64L-G09RevD.01
frameworkgroup: C1[X(C10H6N2O4)]
method: RPBEPBE
basis: SDD
operation: Freq
keyword: #p
keyword: freq=noraman
keyword: PBEPBE/SDD
title: #p freq=noraman PBEPBE/SDD
converged: YES YES NO NO
title: Mulliken charges:
elementType: O O O O N N C C C C C C C C C C H H H H H H
charge: -0.193595 -0.193856 -0.404250 -0.235460 0.023793 -0.016197 0.506916 -0.518938 0.375967 -0.331387 -0.362555 -0.206558 -0.301583 0.143504 0.137671 -0.204829 0.295954 0.268023 0.295675 0.251593 0.274924 0.395188
chargesum: 0.00000
title: Mulliken charges with hydrogens summed into heavy atoms:
elementType: O O O O N N C C C C C C C C C C
charge: -0.193595 -0.193856 -0.009062 -0.235460 0.023793 -0.016197 0.506916 -0.222983 0.375967 -0.063364 -0.066880 0.045035 -0.026659 0.143504 0.137671 -0.204829
polarizability: 2.51708544e+02 -7.49707995e-01 1.56128317e+02 -3.86104494e-02 2.17902760e-02 5.13697522e+01
1716.lowfreq: -2.0746 -0.0004 0.0005 0.0006 3.4037 4.8223 30.7202 49.6974 64.0610
frequency: 30.6567 49.6964 64.0573 87.2010 93.0023 141.9420 168.4631 186.6069 230.6859 241.0514 305.2502 331.2545 383.3277 421.3333 424.7718 494.7592 496.3713 517.9568 570.1356 578.8725 632.0865 640.1229 673.2259 686.7919 703.7458 734.8067 768.1343 774.2070 827.2653 903.5766 936.2221 958.0801 986.5896 1000.5858 1012.2091 1039.4940 1091.6227 1093.6509 1111.1569 1189.1633 1210.5780 1236.6182 1309.8636 1317.5028 1365.0651 1378.4954 1404.1587 1438.3449 1480.5414 1573.0154 1596.8973 1614.6503 1645.0047 2168.2660 3105.2657 3160.4130 3164.3489 3184.5279 3193.1000 3529.1958
redmass: 8.9685 11.5494 9.4099 9.2426 6.2070 12.7342 5.1786 9.2654 6.0128 8.4145 7.2258 4.1339 8.6809 9.1479 3.1732 9.9781 4.3225 7.4806 2.5313 6.6138 1.7132 6.1406 6.9432 1.9677 6.8756 7.9816 9.1889 7.2205 1.4737 5.5450 1.4290 1.4088 6.1220 1.4859 1.3775 3.8618 1.7572 2.0030 1.9591 1.2316 3.6999 2.7315 1.4761 2.8038 2.5906 10.7773 2.8273 3.2941 2.5542 6.1129 7.3470 7.0145 8.8363 12.6178 1.0886 1.0891 1.0924 1.0930 1.0976 1.0644
irintensity: 3.3866 0.0864 4.3109 1.7727 0.5714 2.0663 0.7360 5.1216 0.0840 0.1736 0.0960 0.1977 4.7548 2.9385 0.1998 18.5704 2.2225 0.3157 65.0009 76.9382 102.4587 27.4067 7.5395 42.8971 8.2559 18.5621 15.1293 0.9541 31.7965 26.8324 5.7202 2.8050 4.6699 24.7782 1.0751 260.3781 65.3424 6.3485 225.6622 51.5506 187.9072 47.7572 15.8896 101.1182 10.1745 88.7834 17.5325 40.8260 25.0078 1.3465 244.8175 5.3155 178.3875 8.8651 0.7560 5.1158 4.2529 6.4745 2.1507 83.4550
temp: 298.150 k
press: 1.00000 atm
elementType: 8 8 8 8 7 7 6 6 6 6 6 6 6 6 6 6 1 1 1 1 1 1
symmnumber: 1
zpe: 380747.3 jmol-1
zpe.correction: 0.145019 hartree
zpe.thermalcorrener: 0.158912 hartree
zpe.thermalcorrenthalpy: 0.159857 hartree
zpe.thermalcorrgfe: 0.102486 hartree
zpe.sumelectzpe: -793.842870 hartree
zpe.sumelectthermal: -793.828977 hartree
zpe.sumelectthermalent: -793.828033 hartree
zpe.sumelectthermalfe: -793.885403 hartree
dipole: -1.5394 1.2317 -0.0204
dipole: 1.9716
quadrupole: -103.9350 -99.2880 -90.8819
quadrupole: 21.1492 -0.0055 -0.0533
quadrupole: -5.9000 -1.2530 7.1531 21.1492 -0.0055 -0.0533
hfenergy: -793.9878893 hartree
pointgroup: C01 [X(C10H6N2O4)]
dipole: 0.5559042 -0.4451707 0.3073432 debye
dipolederiv: -0.9337388 -0.05469 -0.0041091 0.0372868 -0.4027394 0.1198947 -0.0623202 0.1147908 -0.2959528 -0.5578715 0.0453591 -0.0475877 0.0867344 -0.6281185 0.2679726 -0.0739576 0.2651382 -0.3918187 -1.4423339 0.211371 -0.1957765 0.2668628 -0.3604015 -0.0139158 -0.2323519 -0.0168262 -0.4077834 -0.7346476 -0.1414646 0.067283 -0.287692 -0.837693 0.3200213 0.1613569 0.3275932 -0.5189352 1.5887175 -0.1811852 0.1922805 -0.3585379 0.9357734 -0.4986895 0.3052417 -0.4883079 0.5184957 -0.2401521 -0.0015532 0.0006981 0.0496767 -0.2633225 0.0208815 -0.0327846 0.0178639 -0.2487352 -0.3524137 -0.0460144 0.0089703 -0.1043442 -0.1258598 0.0827956 0.0486192 0.0863222 -0.0396311 0.2357462 -0.0615494 0.057931 -0.0615718 -0.0549734 -0.0314828 0.0585259 -0.0310267 -0.0753666 -0.3738974 0.1450329 -0.1171969 0.1141434 -0.1362688 0.1392277 -0.0983059 0.1412628 -0.0237283 0.0840643 -0.0306888 0.0277289 0.1634078 0.006847 -0.0422194 -0.0975504 -0.0536097 -0.0452299 -0.0167911 0.0416518 -0.0230326 -0.2383038 0.0335594 -0.0908445 0.1562696 -0.0753326 -0.0309507 -0.4422301 0.094626 -0.0781303 0.1502774 0.104253 -0.1396784 -0.1130821 -0.1431747 -0.0428007 1.1259077 0.0682596 0.0227471 0.0966527 -0.0031437 -0.0126219 0.0043798 -0.0139818 -0.0212409 -1.1443264 -0.1783458 0.0463843 -0.1595901 -0.0425854 0.0481852 0.0338259 0.0472813 0.0177667 2.2962571 0.1726313 0.0058965 0.5171712 1.0151002 -0.4634212 -0.2152181 -0.4828052 0.550372 0.003305 -0.0398546 0.0224933 -0.0977309 0.1531123 -0.0637316 0.0604421 -0.0602775 0.1053093 0.1418758 -0.0311261 0.0186399 -0.0501852 0.0902254 0.0462171 0.0310091 0.0473006 0.1384364 0.1008407 0.0448648 -0.0306683 0.0324622 0.0867342 0.0399574 -0.0226962 0.0408284 0.1190132 0.0748529 -0.037658 0.0187158 -0.0112713 0.1449692 0.0167868 0.0017957 0.0154489 0.1624965 0.0638402 -0.0147844 0.0043011 -0.034115 0.0036899 0.0954802 0.016881 0.0965571 0.0955004 0.1187185 0.0395567 -0.0259579 -0.0104173 0.0579417 0.0448019 0.0051915 0.0474305 0.0979036 0.4042765 -0.0444388 0.0283895 -0.1009158 0.2229003 0.1143833 0.0647285 0.1175242 0.3368799 unknown
polarizability: 250.2280406|-3.2106777|125.9989439|13.3029673|-48.0793212|82.9796286 unknown
InChI: InChI=1S/C10H6N2O4/c11-6-8(10(13)14)4-7-2-1-3-9(5-7)12(15)16/h1-5,13H
charge 0 multiplicity 1
22 atoms
O  -4.879131 0.374375 -0.768323
O  -3.401761 1.873812 -1.648743
O  4.821431 0.065925 -0.026889
O  3.556212 1.67465 -1.136955
N  -3.682931 0.806744 -0.980902
N  2.90872 -2.349153 1.421699
C  -0.142196 -0.263734 -0.101595
C  -1.239391 0.473259 -0.633216
C  -2.551549 0.020772 -0.415976
C  -0.419141 -1.45297 0.642917
C  -2.832566 -1.151668 0.317945
C  -1.745741 -1.882445 0.84474
C  1.193611 0.270988 -0.368458
C  2.444679 -0.185393 -0.000903
C  3.621412 0.624771 -0.456939
C  2.69891 -1.364592 0.774038
H  -1.081706 1.3899 -1.210529
H  0.398211 -2.042442 1.064325
H  -3.8701 -1.464844 0.460976
H  -1.935409 -2.795192 1.417463
H  1.223695 1.195814 -0.964138
H  5.585041 0.621023 -0.341338
