program: Gaussian 09
title: 000223663
version: EM64L-G09RevD.01
frameworkgroup: C1[X(C8H8Cl3NO)]
method: RPBEPBE
basis: SDD
operation: Freq
keyword: #p
keyword: freq=noraman
keyword: PBEPBE/SDD
title: #p freq=noraman PBEPBE/SDD
converged: YES YES NO NO
title: Mulliken charges:
elementType: Cl Cl Cl O N C C C C C C C C H H H H H H H H
charge: 0.120032 0.082250 0.083900 -0.427855 -0.102112 0.162716 -0.611098 -0.656094 -0.164680 -0.140064 -0.332924 -0.320116 0.164955 0.237474 0.236407 0.243640 0.259708 0.257755 0.252580 0.275644 0.377883
chargesum: 0.00000
title: Mulliken charges with hydrogens summed into heavy atoms:
elementType: Cl Cl Cl O N C C C C C C C C
charge: 0.120032 0.082250 0.083900 -0.049972 -0.102112 0.162716 -0.611098 0.061427 0.095028 0.117690 -0.080344 -0.044473 0.164955
polarizability: 1.99124219e+02 7.26846321e+00 1.12858339e+02 -2.25234629e+01 4.61798166e+00 9.26335063e+01
1716.lowfreq: -8.0383 -2.9397 -0.0024 -0.0024 -0.0023 8.5166 36.4639 60.7470 133.7890
frequency: 36.3083 60.7337 133.7868 155.0251 184.3310 191.2178 206.0442 232.4034 236.5406 261.2790 271.6014 292.8850 316.3723 365.4377 367.4200 423.3311 455.2090 467.9067 507.5419 578.7069 586.6359 664.5905 702.7163 727.1912 754.0171 772.1699 781.7986 831.9972 896.7919 920.8682 946.3867 955.5546 985.6691 999.7836 1055.0230 1114.5383 1120.1120 1192.4284 1252.4428 1270.1829 1311.7644 1368.3635 1385.8626 1413.3337 1462.1731 1471.7659 1546.1420 1614.3493 1664.4294 3000.0475 3106.5730 3111.4236 3133.8202 3136.7443 3164.5609 3179.0529 3570.8609
redmass: 7.6995 7.9052 8.0681 6.3597 3.0955 3.7921 2.4123 2.6406 6.5407 7.7269 8.6385 4.9380 5.1337 6.2545 5.1947 2.1022 1.9732 4.2107 2.2195 5.6740 7.2790 3.6709 8.5626 8.4974 4.9388 5.3123 1.3780 1.7996 4.4767 4.1316 2.8107 1.5544 1.2938 1.2916 6.6545 1.4141 2.1926 1.1330 1.3961 1.7270 1.6288 1.3817 1.4436 2.4275 1.0546 1.0526 5.8040 8.5978 7.0835 1.0338 1.1008 1.1008 1.0869 1.0858 1.0986 1.0961 1.0675
irintensity: 0.0951 0.1498 0.2311 0.0563 0.2411 0.3991 0.5296 0.5478 0.9665 1.0885 1.3895 1.5122 13.7028 16.5305 11.1402 48.2080 54.7239 40.8239 39.6424 5.0880 1.5031 42.1559 139.0654 123.4098 23.0738 9.0940 8.5496 91.6085 238.9833 65.9213 10.6709 14.5876 1.0888 1.6288 10.0913 6.9563 12.4583 11.7115 63.2100 11.2669 30.1017 9.0788 10.9428 5.8486 13.7084 8.7024 0.0903 1.8479 1.1371 15.4303 8.5808 14.4382 4.0462 0.2937 9.3289 3.0697 101.7032
temp: 298.150 k
press: 1.00000 atm
elementType: 17 17 17 8 7 6 6 6 6 6 6 6 6 1 1 1 1 1 1 1 1
symmnumber: 1
zpe: 376322.7 jmol-1
zpe.correction: 0.143334 hartree
zpe.thermalcorrener: 0.156795 hartree
zpe.thermalcorrenthalpy: 0.157739 hartree
zpe.thermalcorrgfe: 0.102844 hartree
zpe.sumelectzpe: -1818.750108 hartree
zpe.sumelectthermal: -1818.736647 hartree
zpe.sumelectthermalent: -1818.735702 hartree
zpe.sumelectthermalfe: -1818.790597 hartree
dipole: -1.5069 0.3193 -1.7294
dipole: 2.3159
quadrupole: -92.4978 -93.3891 -96.5728
quadrupole: 2.5764 -3.6904 0.6190
quadrupole: 1.6554 0.7641 -2.4196 2.5764 -3.6904 0.6190
hfenergy: -1818.8934413 hartree
pointgroup: C01 [X(C8H8Cl3N1O1)]
dipole: 0.555966 0.1265393 0.7107011 debye
dipolederiv: -0.2246146 0.0257616 0.1613539 0.0059619 -0.1490922 -0.1055378 0.0650815 -0.1099592 -0.7110101 -0.4366094 -0.2715244 0.0979615 -0.364286 -0.5777114 0.1714174 0.0783688 0.1532898 -0.2367577 -0.5406094 0.3175018 -0.006626 0.370701 -0.5350611 -0.0107635 -0.061097 0.004118 -0.1694343 -0.9253665 0.3184369 -0.0051753 1.3235818 -0.5716162 -0.1418793 -0.2122111 -0.0077621 -0.3407207 0.5666496 -0.2549997 -0.0394806 -1.164134 0.1513649 0.0903518 0.139128 -0.0326898 -0.1965325 0.0469332 0.0529941 0.1252852 0.1261478 -0.2097933 0.0489958 0.3630366 0.0588704 -0.0317396 1.1913969 -0.062374 -0.2311931 -0.0223932 1.2512149 -0.0574155 -0.1206592 -0.0543327 1.0884555 -0.1635944 -0.0221455 -0.073329 -0.0306396 0.0229785 -0.0167075 -0.0813189 -0.0077043 -0.0066224 -0.0874402 -0.0358856 -0.0704157 0.1127809 0.0737924 -0.0692397 -0.158977 -0.0904838 -0.1982513 0.064359 0.0225847 -0.0933074 -0.2132262 0.1133271 -0.0655084 -0.1059153 -0.0578632 -0.1728703 0.0881967 0.0026151 -0.0297229 -0.1540737 0.0729662 -0.0403492 -0.0648847 -0.0693046 -0.1144317 -0.1309756 -0.0887022 0.0235507 0.0658724 -0.0411466 -0.0053833 -0.0676424 0.0197761 -0.0833449 -0.0477498 0.0706277 -0.0140866 0.0211081 0.158257 -0.0251059 0.0186969 -0.0307239 0.0743732 0.0117825 0.0938481 0.0478862 0.1161377 -0.0184317 -0.0203145 0.0396422 0.029819 0.0838392 0.0391408 -0.0574757 0.0711376 -0.0846087 -0.0309014 0.0771887 0.0824006 0.0200425 0.0651088 -0.0148245 -0.0315132 -0.0971312 -0.0352814 0.0937186 -0.0281014 -0.122197 -0.0271469 0.0042471 0.0492068 0.0910182 0.0180044 0.0462851 -0.0066294 0.0279033 0.0462392 0.0282216 0.1371321 0.0620948 -0.0632147 0.0474531 -0.0162044 -0.0209325 0.0402788 0.055562 0.039443 0.1142924 0.0480033 -0.0727066 0.0311692 -0.0141752 -0.0208508 0.0449133 0.0394515 0.0590146 0.1527879 0.0530695 0.0700602 0.0008969 0.0118427 0.0120176 0.0341932 0.0351594 0.0234429 0.1706219 0.3509513 -0.1049067 0.0357692 -0.1013968 0.2325297 0.0510636 0.032136 0.0519326 0.3708572 unknown
polarizability: 201.2722853|-6.1458523|112.7985033|-16.9282913|-5.009584|90.5452755 unknown
InChI: InChI=1S/C8H8Cl3NO/c1-7(8(9,10)11)4-2-6(12-13)3-5-7/h2-5,13H,1H3
charge 0 multiplicity 1
21 atoms
Cl -1.456825 -0.489711 -2.157944
Cl -3.043412 -1.708421 0.106342
Cl -3.301841 1.236617 -0.500176
O  4.062822 -0.810201 -0.115757
N  3.319668 0.437552 -0.271462
C  -0.890059 0.121691 0.555366
C  -2.075178 -0.186171 -0.427379
C  -1.44878 0.367251 1.99948
C  -0.168957 1.383685 0.091768
C  0.044325 -1.083935 0.604485
C  1.171954 1.435535 -0.143332
C  1.384868 -1.015432 0.368706
C  2.022658 0.248355 -0.017056
H  -2.137402 1.228954 2.016065
H  -1.981298 -0.521803 2.377969
H  -0.59648 0.581392 2.664993
H  -0.783845 2.285177 -0.005241
H  -0.418049 -2.035042 0.893859
H  1.658121 2.372405 -0.435542
H  2.018011 -1.902408 0.459928
H  4.989299 -0.53209 -0.332868
