program: Gaussian 09
title: 000223661
version: EM64L-G09RevD.01
frameworkgroup: C1[X(C8H13NO4)]
method: RPBEPBE
basis: SDD
operation: Freq
keyword: #p
keyword: freq=noraman
keyword: PBEPBE/SDD
title: #p freq=noraman PBEPBE/SDD
converged: YES YES NO NO
title: Mulliken charges:
elementType: O O O O N C C C C C C C C H H H H H H H H H H H H H
charge: -0.235866 -0.207642 -0.203192 -0.194849 0.153706 0.334040 -0.086229 -0.478626 -0.745415 -0.746256 -0.534279 -0.441501 0.198633 0.280164 0.216982 0.234063 0.220783 0.236457 0.226581 0.231604 0.223120 0.234730 0.259549 0.263403 0.260941 0.299099
chargesum: 0.00000
title: Mulliken charges with hydrogens summed into heavy atoms:
elementType: O O O O N C C C C C C C C
charge: -0.235866 -0.207642 -0.203192 -0.194849 0.153706 0.334040 0.193935 -0.027580 -0.061595 -0.056801 -0.011326 0.118538 0.198633
polarizability: 1.22095224e+02 8.52074633e+00 9.47268425e+01 5.56479911e-01 6.43420681e-01 9.43929399e+01
1716.lowfreq: -28.2056 -10.0958 -0.0011 -0.0010 -0.0008 8.7464 36.6402 54.0294 64.2248
frequency: 36.4468 53.6507 63.8687 79.3801 159.3996 197.0890 218.2157 238.1059 260.7594 290.7267 298.5898 341.3178 354.7045 392.5810 428.3706 447.0236 495.2299 507.6345 552.3356 591.4556 652.5046 657.3436 728.0890 744.4526 836.2196 858.6353 880.3197 915.6919 946.3991 950.6678 979.9478 1011.2996 1022.1926 1027.3688 1078.3229 1127.1486 1136.9337 1167.3237 1183.3618 1223.7107 1229.7857 1243.9045 1279.1496 1298.6964 1321.0385 1325.5266 1339.1105 1353.6711 1388.1115 1411.1297 1428.8126 1444.2752 1445.0467 1467.2272 1475.3648 1481.3099 1488.5942 1498.8660 1665.8045 2979.7053 2982.9115 2989.7936 2999.5475 3038.1590 3044.3830 3050.7102 3071.3480 3074.6672 3076.8462 3081.3795 3085.4657 3124.1895
redmass: 11.5076 4.4888 8.1113 3.9965 3.2102 1.8270 2.4965 1.3525 1.3199 5.2820 1.9879 3.3058 3.3167 3.6138 3.3821 3.1449 2.9319 3.1742 5.5443 3.8874 7.0856 4.3950 3.3917 3.1141 2.6273 5.4978 2.0609 2.0874 1.7590 2.6944 1.6085 1.6931 1.8129 1.9359 3.4837 3.9373 1.5496 1.3393 2.0636 3.3946 1.7027 2.1849 1.7010 1.5462 1.4456 1.3984 1.4991 1.5281 1.1955 1.2022 2.8619 1.0708 1.2273 1.0723 1.0500 1.0808 1.0621 1.0643 12.1997 1.0363 1.0375 1.0600 1.0662 1.0598 1.0980 1.0869 1.0967 1.0995 1.0995 1.0995 1.0993 1.1044
irintensity: 1.2142 2.0223 4.3681 4.6296 7.3403 0.8979 3.3034 0.5126 0.8392 1.8172 1.2502 1.5025 3.5531 2.6242 1.0008 2.5347 2.3012 4.5143 9.2064 9.0897 8.3877 4.5199 21.1269 4.7662 7.7036 11.5354 7.9019 3.2681 5.4311 86.9064 24.4114 12.1514 74.2175 60.0259 7.7924 166.8839 0.0218 33.0893 10.3974 57.4460 2.2157 21.5040 1.1769 7.9988 5.2096 19.3205 6.6039 14.0620 12.7741 18.8149 130.9140 20.9731 12.1411 5.2391 10.3665 10.8882 7.5438 25.8508 314.9125 15.3860 24.5639 29.0691 6.5721 1.9233 22.7547 2.9965 11.9855 12.7975 23.0439 34.0974 28.6354 3.2786
temp: 298.150 k
press: 1.00000 atm
elementType: 8 8 8 8 7 6 6 6 6 6 6 6 6 1 1 1 1 1 1 1 1 1 1 1 1 1
symmnumber: 1
zpe: 546211.0 jmol-1
zpe.correction: 0.208041 hartree
zpe.thermalcorrener: 0.221303 hartree
zpe.thermalcorrenthalpy: 0.222247 hartree
zpe.thermalcorrgfe: 0.167704 hartree
zpe.sumelectzpe: -667.189872 hartree
zpe.sumelectthermal: -667.176609 hartree
zpe.sumelectthermalent: -667.175665 hartree
zpe.sumelectthermalfe: -667.230208 hartree
dipole: -1.1819 4.0428 -1.7851
dipole: 4.5747
quadrupole: -99.8508 -78.9827 -78.2807
quadrupole: -10.6919 3.4861 2.6300
quadrupole: -14.1460 6.7220 7.4240 -10.6919 3.4861 2.6300
hfenergy: -667.3979125 hartree
pointgroup: C01 [X(C8H13N1O4)]
dipole: -1.5033943 -0.7977082 0.5855275 debye
dipolederiv: -0.8606478 0.6224347 0.0961838 0.3642177 -1.1437721 -0.0330736 0.2153476 -0.3573303 -0.3463351 -0.4842718 0.0102993 0.0698024 0.1713667 -1.2836939 0.0375274 0.0938685 0.0730778 -0.3737581 -0.3657824 0.1394085 0.1156298 0.1810454 -0.3997759 -0.135017 -0.0243791 0.0268252 -0.7017354 -0.3681462 0.139982 -0.1363811 0.2423371 -0.455818 0.1944946 -0.0698305 0.0657741 -0.6862968 0.4574244 -0.3531381 0.0079456 -0.574628 0.7292829 -0.0614741 0.0133379 -0.0413595 1.1519476 0.0517032 0.0157686 0.0304874 0.0521179 -0.0064641 0.0461336 -0.0372991 0.0729723 0.0673372 0.4991948 -0.0399206 0.0618275 -0.1879218 0.6484279 -0.0551988 0.1967967 -0.22121 0.1940015 0.0558156 -0.0023675 0.0241264 0.0264314 0.0249999 -0.01677 0.0427334 -0.0129602 0.0622864 -0.0176093 0.0156322 -0.0505292 -0.012741 0.0293861 -0.0158339 -0.0215159 0.0059441 -0.0326652 0.0055539 -0.0276968 -0.0127926 0.0135663 -0.0476315 0.0127782 0.0022858 0.0147994 0.0074653 -0.1657597 -0.092846 0.169552 -0.0500006 -0.0780405 0.0587937 0.1513195 -0.0018749 0.0448002 0.0002124 0.0870386 -0.0556553 0.1369962 -0.1120081 -0.0342859 -0.1060342 0.0481736 0.0516317 1.0479246 -0.530293 -0.3579633 -0.3275596 1.8323095 0.0260968 -0.537176 0.3532502 0.4015905 0.0544429 0.0124172 0.0336334 0.0231186 0.0034425 -0.0346772 0.0293623 -0.0196021 -0.0128672 0.0018215 0.029471 -0.14814 0.0153892 0.0278772 -0.0085944 -0.1195946 0.000423 -0.0878468 -0.0940949 -0.0863659 0.0749922 -0.102515 -0.0084958 0.056494 0.0369246 0.0320504 0.0668229 -0.1151934 -0.08485 0.0135426 -0.0822854 0.0585566 0.0126491 0.0681614 0.0417767 0.0537958 0.0766895 0.0331987 -0.0183768 0.0516973 -0.0910064 0.1097467 -0.0229662 0.0767914 0.0544524 0.0432549 0.080758 0.0853885 0.0431129 0.0015734 -0.1138544 0.0333603 -0.0894794 -0.0194769 0.0464764 0.0265467 -0.115551 0.0011664 0.0651655 -0.025692 -0.1161116 0.0125384 -0.0700107 -0.0995135 -0.1303538 0.0384907 -0.0612212 0.0141562 0.0195237 0.0197885 0.0313172 0.1000282 0.0490703 0.0904516 0.0766076 0.0597719 0.0206703 -0.0286674 0.085778 -0.0869917 -0.0205655 0.0995756 0.0220551 0.0200832 0.0287721 -0.0214155 -0.0736482 0.0647559 -0.0710669 -0.0077446 0.0059582 -0.0042802 -0.0681888 -0.0410174 0.0734664 0.0314736 -0.0951564 0.0590089 0.0172905 0.0717203 0.0655809 0.0398728 0.0537449 0.0626421 0.032419 0.0287669 0.0002062 -0.0230688 0.0041806 -0.0389311 0.0054121 -0.024962 0.0561655 -0.0013435 0.0674764 -0.0130537 0.1089209 unknown
polarizability: 100.288877|-13.9427535|116.3827358|1.20281|-1.4407416|94.5433931 unknown
InChI: InChI=1S/C8H13NO4/c1-8(2)4-3-7(10)13-6(8)5-9(11)12/h6H,3-5H2,1-2H3
charge 0 multiplicity 1
26 atoms
O  -0.128558 1.252506 -0.761841
O  -1.076567 3.254185 -0.243712
O  2.414643 -1.914993 -0.739973
O  2.483781 -2.042026 1.536426
N  2.110807 -1.49279 0.435929
C  -1.204162 -0.953726 -0.084435
C  0.099323 -0.205695 -0.481448
C  -1.897844 -0.164013 1.058795
C  -2.117232 -1.040371 -1.338807
C  -0.879636 -2.391338 0.39654
C  -2.225171 1.285826 0.64916
C  1.263855 -0.224025 0.536701
C  -1.11892 2.018279 -0.105366
H  0.485879 -0.595124 -1.440078
H  -1.249648 -0.162763 1.957158
H  -2.828167 -0.685157 1.351535
H  -3.107765 -1.4491 -1.067476
H  -2.268786 -0.058481 -1.820671
H  -1.670538 -1.712779 -2.093905
H  -0.308391 -2.402646 1.342682
H  -1.822893 -2.938603 0.576508
H  -0.305785 -2.955687 -0.361082
H  -2.489823 1.908231 1.521455
H  -3.109446 1.307041 -0.017342
H  0.952862 -0.14584 1.588888
H  1.945385 0.60799 0.286759
