program: Gaussian 09
title: 000223658
version: EM64L-G09RevD.01
frameworkgroup: C1[X(C14H24N2O4)]
method: RPBEPBE
basis: SDD
operation: Freq
keyword: #p
keyword: freq=noraman
keyword: PBEPBE/SDD
title: #p freq=noraman PBEPBE/SDD
converged: YES YES NO NO
title: Mulliken charges:
elementType: O O O O N N C C C C C C C C C C C C C C H H H H H H H H H H H H H H H H H H H H H H H H
charge: -0.244787 -0.244774 -0.288108 -0.288080 -0.151306 -0.151263 -0.369125 -0.369178 -0.537730 -0.537643 -0.366393 -0.373920 -0.374082 -0.366529 0.243729 0.243639 -0.302157 -0.290385 -0.290301 -0.302095 0.213056 0.212552 0.213103 0.212519 0.231577 0.228420 0.228369 0.231596 0.224849 0.264813 0.236814 0.230374 0.236828 0.230409 0.224853 0.264828 0.223450 0.200557 0.191567 0.222170 0.191571 0.222172 0.223446 0.200596
chargesum: 0.00000
title: Mulliken charges with hydrogens summed into heavy atoms:
elementType: O O O O N N C C C C C C C C C C C C C C
charge: -0.244787 -0.244774 -0.288108 -0.288080 -0.151306 -0.151263 0.056484 0.056444 -0.077734 -0.077678 0.123269 0.093268 0.093154 0.123152 0.243729 0.243639 0.121849 0.123352 0.123442 0.121947
polarizability: 2.31787371e+02 -8.26155766e+00 1.71857144e+02 -7.36215980e-03 -1.65039736e-02 1.26564814e+02
1716.lowfreq: 0.0003 0.0006 0.0009 2.1419 6.7655 14.8541 18.3681 34.9844 35.5411
frequency: 14.8359 34.9264 35.3320 48.1992 59.0411 65.7692 87.0411 92.1471 104.0454 141.4247 150.0378 161.8145 180.7074 217.9173 271.2279 277.1946 282.2315 330.9045 342.4785 363.9842 385.7717 397.5791 398.1108 446.4768 453.7795 482.4543 503.7671 539.4365 544.4130 562.0343 568.4697 618.0483 625.5126 726.6812 750.4581 767.1440 795.1989 795.6744 802.7916 833.6593 834.0786 891.7588 896.2302 907.4412 932.3602 940.4868 1012.2684 1012.4707 1017.2851 1020.1131 1050.8990 1051.0458 1057.1084 1061.5130 1070.9253 1071.3509 1072.3324 1093.8828 1108.1258 1109.7344 1124.1015 1181.9753 1184.6618 1192.2011 1192.3200 1199.7680 1213.1623 1237.3429 1237.9135 1257.8632 1260.2300 1273.3150 1273.3619 1286.5397 1291.0715 1296.8255 1325.3543 1327.3309 1339.4265 1341.6001 1343.2064 1353.6773 1354.1054 1363.5343 1366.8576 1366.8733 1412.7093 1413.9872 1443.2238 1446.2804 1447.7333 1447.7446 1453.7635 1453.8056 1455.7076 1455.9818 1463.2380 1463.8345 1464.1014 1479.5332 1581.4827 1582.5896 2946.7775 2946.8495 2958.8633 2958.9473 2960.8773 2961.3560 2973.3493 2973.4922 2982.2502 2982.3623 2991.8847 3000.3981 3008.4007 3009.3517 3040.9482 3069.2076 3081.1089 3081.1215 3081.8898 3081.9298 3088.9695 3089.0206 3097.7114 3097.9502
redmass: 6.0748 3.5829 5.4914 3.7609 5.2383 5.3092 4.7539 1.7080 4.4003 2.8278 3.7156 2.4756 3.1879 2.4109 2.4016 2.9489 2.9597 3.2316 4.8702 4.8644 5.1920 1.9004 1.9098 2.9188 2.7287 4.0498 4.2084 2.5691 2.6414 3.3244 3.5335 2.3531 2.2707 1.1248 4.4807 4.3271 4.0510 4.2013 1.4460 1.6723 1.6678 2.7719 2.4612 1.5587 3.1993 3.1751 2.3298 2.3449 2.8735 2.6761 2.2028 2.2028 3.2617 2.6875 2.5659 3.5391 2.1929 2.4961 2.1345 2.1307 1.2595 2.2522 2.6651 1.0720 1.0788 1.5923 1.5764 1.4330 1.3412 1.6513 1.6571 1.2008 1.2012 1.0450 1.4465 1.1601 1.2610 1.2403 1.3825 1.2255 1.3337 1.3859 1.3331 1.6392 1.3047 1.3040 2.6902 2.7933 1.1061 1.1057 1.0836 1.0836 1.0985 1.0990 1.0848 1.0844 1.0801 1.1178 1.1208 1.0957 8.0815 7.9080 1.0683 1.0683 1.0679 1.0680 1.0594 1.0599 1.0678 1.0678 1.0649 1.0649 1.0612 1.0597 1.0982 1.0992 1.1026 1.1038 1.0957 1.0957 1.0963 1.0963 1.0988 1.0988 1.0925 1.0924
irintensity: 1.0073 1.9502 1.4022 0.1130 5.6762 0.0035 3.5643 0.0200 0.0003 0.2172 2.5057 0.4648 8.1787 0.1518 2.5103 0.0571 36.4162 1.4267 0.8248 38.3273 0.1750 0.3429 2.9967 2.1761 0.0477 1.7482 1.7987 14.2668 0.0176 25.3760 8.5265 7.8061 1.1486 12.3388 0.0372 1.4955 40.5269 0.8725 0.2035 0.0075 0.8097 4.6026 0.2267 6.0659 11.6076 0.5456 20.3660 10.5982 81.3398 3.8567 0.3254 72.5283 1.9178 0.6010 41.3701 0.0284 26.7096 0.4672 16.8521 0.0490 0.1744 30.0105 0.9296 1.4645 0.0946 174.5951 8.9347 139.9449 33.5242 0.0352 130.2503 5.3169 15.3557 0.4529 0.7478 0.0514 0.2994 0.0212 23.4014 0.0094 1.4030 0.6144 3.0078 0.0227 2.1425 0.2731 261.4809 0.2536 43.2383 0.0172 3.3475 8.8497 10.1385 25.4834 10.6156 0.9796 0.0107 3.0000 15.8644 18.3012 499.4043 0.1235 48.1995 47.2655 31.2697 63.6446 38.3944 0.0198 38.9305 43.5755 46.6971 91.3874 0.0132 41.7962 0.0991 15.8406 0.0126 72.2804 17.1920 59.5889 20.6341 4.0864 59.3590 12.2381 17.6414 16.4041
temp: 298.150 k
press: 1.00000 atm
elementType: 8 8 8 8 7 7 6 6 6 6 6 6 6 6 6 6 6 6 6 6 1 1 1 1 1 1 1 1 1 1 1 1 1 1 1 1 1 1 1 1 1 1 1 1
symmnumber: 1
zpe: 984439.8 jmol-1
zpe.correction: 0.374953 hartree
zpe.thermalcorrener: 0.395357 hartree
zpe.thermalcorrenthalpy: 0.396301 hartree
zpe.thermalcorrgfe: 0.322906 hartree
zpe.sumelectzpe: -956.685604 hartree
zpe.sumelectthermal: -956.665200 hartree
zpe.sumelectthermalent: -956.664256 hartree
zpe.sumelectthermalfe: -956.737652 hartree
dipole: 0.0006 0.0002 -0.0057
dipole: 0.0057
quadrupole: -132.2329 -126.9959 -117.4983
quadrupole: -7.8645 0.0364 -0.0152
quadrupole: -6.6572 -1.4202 8.0774 -7.8645 0.0364 -0.0152
hfenergy: -957.0605572 hartree
pointgroup: C01 [X(C14H24N2O4)]
dipole: -0.0002487 -0.0000773 -0.0022379 debye
polarizability: 231.7221264|-8.4944885|171.9207149|0.0534886|-0.276087|126.5664875 unknown
InChI: InChI=1S/C14H24N2O4/c17-13(15-5-9-19-10-6-15)3-1-2-4-14(18)16-7-11-20-12-8-16/h1-12H2
charge 0 multiplicity 1
44 atoms
O  -6.972555 0.711472 0.636556
O  6.97308 -0.704136 0.648075
O  -2.962885 -2.001326 -0.242548
O  2.966603 1.998646 -0.269625
N  -4.415565 -0.192948 -0.331185
N  4.418767 0.188945 -0.336909
C  -0.59141 -0.494538 -0.262396
C  0.594638 0.492181 -0.268806
C  -1.947772 0.237667 -0.256651
C  1.950896 -0.240107 -0.25636
C  -5.595917 -1.084554 -0.395253
C  -4.754891 1.243985 -0.358993
C  4.757958 -1.248246 -0.346543
C  5.599577 1.079246 -0.40989
C  -3.133702 -0.740604 -0.273998
C  3.137066 0.737595 -0.285995
C  -6.593472 -0.714257 0.716559
C  -5.778207 1.559864 0.755687
C  5.778169 -1.550713 0.774638
C  6.594437 0.722655 0.708842
H  -0.545487 -1.161012 -1.144687
H  -0.538041 -1.160585 0.619735
H  0.547644 1.148508 -1.158618
H  0.542425 1.16826 0.605722
H  -2.009513 0.914185 -1.133688
H  -2.012001 0.888159 0.639983
H  2.015977 -0.880412 0.647516
H  2.01154 -0.926549 -1.12573
H  -6.084956 -0.971166 -1.383922
H  -5.23753 -2.122253 -0.289198
H  -3.852977 1.860808 -0.223922
H  -5.204577 1.496743 -1.34149
H  3.855674 -1.863457 -0.206807
H  5.21046 -1.512554 -1.324685
H  6.090692 0.95303 -1.395967
H  5.241418 2.118354 -0.317788
H  -7.537394 -1.272457 0.607115
H  -6.147859 -0.927434 1.711941
H  -5.304503 1.409616 1.750872
H  -6.143449 2.596965 0.673151
H  5.301839 -1.38806 1.766626
H  6.143399 -2.58883 0.705973
H  7.538893 1.27895 0.594421
H  6.146611 0.948867 1.700337
