program: Gaussian 09
title: 000223657
version: EM64L-G09RevD.01
frameworkgroup: C1[X(C15H21NO2)]
method: RPBEPBE
basis: SDD
operation: Freq
keyword: #p
keyword: freq=noraman
keyword: PBEPBE/SDD
title: #p freq=noraman PBEPBE/SDD
converged: YES YES NO NO
title: Mulliken charges:
elementType: O O N C C C C C C C C C C C C C C C H H H H H H H H H H H H H H H H H H H H H
charge: -0.292026 -0.307344 -0.177154 -0.375578 -0.383418 0.374861 0.268560 -0.683574 -0.658059 -0.493575 -0.377528 -0.389880 -0.232280 -0.224954 0.237149 -0.235714 -0.259450 -0.670171 0.300864 0.195827 0.248439 0.208464 0.206581 0.248038 0.217715 0.231278 0.232404 0.211926 0.255745 0.248043 0.263339 0.228937 0.228733 0.231075 0.226233 0.215296 0.209296 0.222368 0.249531
chargesum: 0.00000
title: Mulliken charges with hydrogens summed into heavy atoms:
elementType: O O N C C C C C C C C C C C C C C C
charge: -0.292026 -0.307344 -0.177154 0.121114 0.073485 0.374861 0.268560 -0.011241 0.017549 -0.237830 -0.129485 -0.126541 -0.003343 0.003779 0.237149 -0.004638 0.182079 0.011025
polarizability: 2.51837360e+02 -6.31835815e-01 1.86872184e+02 -2.74957861e+00 -7.53050258e+00 1.29813175e+02
1716.lowfreq: -7.8932 0.0001 0.0004 0.0006 2.8093 5.1277 32.1799 45.0775 46.3744
frequency: 32.1166 45.0360 46.3639 56.0250 67.0955 82.0194 89.3977 99.3460 114.8330 167.1459 171.0194 205.9410 215.4839 227.3434 247.6765 261.6341 291.8133 304.3416 312.2750 339.2258 387.8873 410.9128 426.1365 461.1371 477.0296 527.9820 613.1093 616.9333 654.9856 674.4091 696.6870 708.8935 711.0743 772.9530 787.2208 795.9308 802.7694 812.0415 830.4431 861.6395 885.7524 919.4041 938.5101 941.9924 984.8503 989.4385 999.1643 1003.5896 1024.8422 1027.9049 1065.6523 1076.0455 1079.7431 1090.9211 1094.3616 1096.8568 1124.4126 1154.6938 1172.1697 1183.6677 1189.4703 1207.4079 1265.7403 1282.0109 1298.5039 1313.1934 1316.8377 1342.3012 1353.8396 1359.9550 1377.5880 1385.5289 1387.8396 1390.4229 1430.9660 1437.3553 1455.2097 1462.1038 1466.3123 1466.9304 1468.9191 1476.6351 1484.7726 1485.1407 1485.1980 1498.0190 1568.3167 1588.1504 1588.7567 1607.4050 2978.3988 2986.0149 2987.2799 2988.3163 2990.1705 3020.9657 3040.3988 3073.9898 3081.3000 3081.7214 3085.1974 3085.8916 3096.6453 3101.6893 3112.5447 3123.1884 3130.2287 3141.4305 3150.7089 3165.0042 3166.7663
redmass: 3.5512 3.7678 2.8851 3.2998 3.0974 3.5241 3.3319 3.4355 3.3240 2.7256 2.3680 1.4130 1.2943 1.4177 2.2504 5.1048 3.2957 2.8101 3.4146 3.6450 2.9137 2.8904 3.1572 2.7983 3.3557 3.3735 6.3856 5.7744 4.9199 4.6410 3.5177 1.9378 3.6534 1.8410 1.8360 1.1886 1.1773 1.4576 1.7571 1.2465 3.0880 2.3702 2.0409 1.7690 1.4922 4.5447 1.3489 3.0125 2.7719 2.7036 2.0750 2.8832 1.6064 2.2447 2.0573 1.7846 2.1251 1.6819 1.0541 1.2473 2.2774 2.0677 2.0007 1.1118 1.3449 1.3140 1.2042 1.2573 1.3154 1.3281 7.3514 1.2351 1.2182 1.2081 2.1323 1.7934 1.1323 1.0459 1.0718 1.0464 1.0734 2.0345 1.0695 1.0560 1.0585 1.3992 6.3118 6.3694 5.8842 6.0962 1.0623 1.0377 1.0362 1.0363 1.0641 1.0589 1.1001 1.0974 1.0999 1.0987 1.0982 1.1024 1.0994 1.1010 1.1045 1.0849 1.0874 1.0921 1.0963 1.1000 1.0900
irintensity: 0.7359 1.7493 0.1452 0.3214 0.7597 1.0330 0.6389 2.1560 0.5137 3.5149 1.5848 0.9136 0.0426 0.8548 0.2344 1.4053 2.4878 4.2146 5.0866 14.3268 9.5792 0.0386 1.5401 2.6827 19.9362 4.4313 2.5551 5.9169 2.3646 16.6944 7.0304 43.5923 2.5846 91.1492 19.6164 4.8477 1.9645 7.0552 28.3288 1.3862 17.6057 26.1831 0.7729 3.8799 1.5119 0.6531 0.2094 0.9081 58.6196 58.7542 11.5089 385.4742 6.7351 54.9312 15.8455 12.0841 186.7038 9.5164 0.0090 7.3541 19.4389 2.0266 68.9176 3.6090 21.1664 2.3170 8.1798 7.2822 6.5204 14.8820 0.3339 26.0203 15.2293 31.3556 5.1731 6.1274 29.4752 11.8452 25.2668 24.1491 16.3957 30.5807 1.0132 20.0215 0.6374 69.3035 251.0128 147.7674 267.6451 0.0498 21.7688 24.2015 29.8526 34.9199 65.2349 48.7166 10.1491 1.1754 21.0514 46.3702 42.7131 11.5153 22.4106 48.6049 40.6764 1.8969 0.3919 15.7130 31.9413 17.7735 10.7985
temp: 298.150 k
press: 1.00000 atm
elementType: 8 8 7 6 6 6 6 6 6 6 6 6 6 6 6 6 6 6 1 1 1 1 1 1 1 1 1 1 1 1 1 1 1 1 1 1 1 1 1
symmnumber: 1
zpe: 863039.6 jmol-1
zpe.correction: 0.328714 hartree
zpe.thermalcorrener: 0.348026 hartree
zpe.thermalcorrenthalpy: 0.348970 hartree
zpe.thermalcorrgfe: 0.279873 hartree
zpe.sumelectzpe: -788.016374 hartree
zpe.sumelectthermal: -787.997063 hartree
zpe.sumelectthermalent: -787.996118 hartree
zpe.sumelectthermalfe: -788.065216 hartree
dipole: 2.4964 0.8000 0.2269
dipole: 2.6312
quadrupole: -96.9282 -100.1785 -109.7317
quadrupole: 2.6654 1.0348 -4.3771
quadrupole: 5.3513 2.1009 -7.4523 2.6654 1.0348 -4.3771
hfenergy: -788.3450885 hartree
pointgroup: C01 [X(C15H21N1O2)]
dipole: 0.9591255 0.3873931 0.0405174 debye
polarizability: 251.6444056|3.9862718|179.2430786|3.2151697|-20.9184597|137.6352346 unknown
InChI: InChI=1S/C15H21NO2/c1-4-16(5-2)14(12-15(17)18-6-3)13-10-8-7-9-11-13/h7-12H,4-6H2,1-3H3
charge 0 multiplicity 1
39 atoms
O  -2.934461 -1.69367 -0.544881
O  -2.800775 0.576751 0.027471
N  0.252103 1.484562 -0.499943
C  -0.770973 2.134862 -1.365505
C  1.069704 2.416796 0.324196
C  0.293018 0.11161 -0.269707
C  1.64641 -0.484391 0.005963
C  -0.796669 1.556462 -2.793872
C  0.251791 3.044352 1.476583
C  -0.781745 -0.780275 -0.361614
C  2.783602 -0.087743 -0.74986
C  1.801876 -1.492294 0.993602
C  4.040582 -0.688345 -0.528042
C  3.060764 -2.091598 1.219412
C  -2.204665 -0.502155 -0.279105
C  4.184692 -1.69217 0.459736
C  -4.407275 -1.609349 -0.359076
C  -4.792566 -1.839689 1.107024
H  -1.774132 2.055751 -0.905922
H  -0.497215 3.20521 -1.412752
H  1.929454 1.868349 0.740576
H  1.47018 3.212853 -0.333706
H  0.185971 1.66366 -3.288533
H  -1.070474 0.488115 -2.795468
H  -1.550455 2.098424 -3.393716
H  -0.619161 3.605419 1.095048
H  -0.12285 2.260218 2.157349
H  0.885152 3.741331 2.056436
H  -0.536833 -1.842593 -0.440155
H  2.663685 0.674346 -1.528887
H  0.931722 -1.791095 1.588501
H  4.904449 -0.382722 -1.128956
H  3.16563 -2.864291 1.989185
H  5.161292 -2.157709 0.633775
H  -4.755672 -0.620185 -0.706338
H  -4.801156 -2.402689 -1.015879
H  -5.893978 -1.848622 1.211969
H  -4.402129 -2.807143 1.468477
H  -4.391299 -1.032245 1.742213
