program: Gaussian 09
title: 000223656
version: EM64L-G09RevD.01
frameworkgroup: C1[X(C19H34O4)]
method: RPBEPBE
basis: SDD
operation: Freq
keyword: #pfreq=noraman
keyword: PBEPBE/SDD
title: #p freq=noraman PBEPBE/SDD
converged: YES YES NO NO
title: Mulliken charges:
elementType: O O O O C C C C C C C C C C C C C C C C C C C H H H H H H H H H H H H H H H H H H H H H H H H H H H H H H H H H H
charge: -0.187017 -0.197988 -0.379028 -0.196605 0.004146 -0.548490 -0.495227 -0.410894 -0.373180 -0.393445 -0.314379 0.204982 -0.387250 -0.387722 0.195631 -0.386222 -0.386540 -0.384585 -0.382439 -0.372593 -0.353579 -0.356651 -0.696638 0.199671 0.250020 0.247552 0.253239 0.274657 0.201341 0.202386 0.182548 0.197041 0.207293 0.255550 0.237523 0.191503 0.195994 0.197859 0.194678 0.192430 0.194207 0.195214 0.193664 0.193085 0.192230 0.192720 0.191930 0.189285 0.188882 0.187969 0.187709 0.373989 0.194585 0.194554 0.209730 0.214857 0.209820
chargesum: 0.00000
title: Mulliken charges with hydrogens summed into heavy atoms:
elementType: O O O O C C C C C C C C C C C C C C C C C C C
charge: -0.187017 -0.197988 -0.005039 -0.196605 0.004146 -0.098800 0.005564 0.065104 0.011754 0.010889 0.178694 0.204982 0.000247 0.004815 0.195631 0.000415 0.002338 0.000729 0.002210 0.005574 0.022099 0.032488 -0.062232
polarizability: 2.89818391e+02 2.60105898e+00 1.78352491e+02 -3.01374714e+00 2.17704346e+00 1.83980629e+02
1716.lowfreq: -3.2271 -0.0021 0.0012 0.0016 1.8356 10.2244 15.3294 20.6023 27.6595
frequency: 11.8799 18.0317 27.4242 37.7394 46.9970 51.2299 53.4373 68.8696 82.9855 84.9331 89.9746 97.8825 115.5724 117.5136 128.1177 142.4837 145.9888 154.3105 158.8512 161.8907 178.3400 198.3598 212.4389 228.4121 243.4209 266.1035 276.7257 301.6630 336.6876 355.2151 367.6010 426.1206 447.8738 480.5882 488.1197 501.2459 514.9044 530.1311 597.5998 643.4369 673.4134 704.1132 721.6894 722.9150 724.9773 726.1879 731.2571 741.1944 757.7671 779.6292 804.6772 834.2554 866.9694 887.4760 892.5230 919.5553 926.7263 962.6495 971.6580 976.8836 985.5626 998.5636 1001.6676 1008.3734 1024.0594 1032.7196 1035.9730 1047.0899 1059.2204 1066.8556 1073.5102 1075.6060 1078.6144 1080.7887 1081.9888 1084.4434 1105.1405 1125.2188 1145.6413 1159.2862 1168.2072 1180.8144 1194.2117 1196.1658 1203.2293 1213.2270 1225.7799 1231.4198 1247.2689 1250.8713 1266.0434 1271.0498 1278.7504 1282.3281 1284.9439 1289.5712 1292.1416 1295.2092 1299.0471 1301.2472 1304.1251 1306.8557 1315.8615 1330.8126 1344.9289 1347.2851 1353.5748 1355.2035 1356.9943 1359.4256 1361.6425 1390.0015 1460.2196 1460.3770 1462.3723 1463.0297 1464.1590 1465.0686 1466.0863 1470.1953 1474.8439 1477.0286 1477.9368 1479.8732 1480.9407 1484.1467 1487.7774 1489.8777 1499.3916 1673.6988 1701.3813 2920.2111 2944.8708 2949.2999 2949.4260 2950.6299 2951.8836 2952.4116 2955.2783 2959.1545 2963.1020 2966.6485 2968.8940 2971.9321 2976.8207 2982.6018 2984.8144 2987.8873 2991.7463 2996.1705 3002.6484 3012.5686 3014.0653 3016.6233 3022.2249 3031.1944 3038.9367 3044.5803 3046.0163 3067.5844 3068.5451 3070.2511 3084.5715 3126.0387 3528.6138
redmass: 4.8718 4.5181 4.5299 4.8412 1.8370 4.3659 2.8527 1.7334 3.1076 4.2390 3.7310 2.1274 2.1262 4.1624 2.1206 1.9518 4.5166 2.2790 3.6128 2.2592 2.6849 3.4889 3.6505 1.1270 3.5704 2.5178 3.7961 2.8090 4.5957 3.9337 3.8368 3.2075 3.5577 2.0398 2.0237 2.7681 3.5000 3.6525 3.7165 5.2314 7.8705 5.0794 1.0586 1.0636 1.4553 1.8448 1.1898 1.1708 1.2576 1.4271 1.5171 1.3562 1.3792 1.9050 1.6906 1.8444 2.0469 1.2833 4.7803 4.2875 4.6734 3.6083 1.2300 3.6165 3.8552 1.3064 2.1323 3.4054 2.5408 2.8414 2.7475 2.6362 2.1157 2.1663 2.1417 2.2761 2.6783 3.2358 1.6731 2.4667 1.4222 1.9048 1.5965 1.4253 1.3653 1.5215 1.3118 1.4919 1.3305 1.3894 1.3195 1.3072 1.0180 1.2271 1.0443 1.2651 1.0760 1.1786 1.1095 1.1151 1.3789 1.1356 1.3521 1.3904 1.4455 1.3133 1.6290 1.6285 1.6526 1.6267 1.5361 1.2177 1.0740 1.0734 1.0721 1.0725 1.0805 1.0674 1.0783 1.0834 1.0832 1.0426 1.0748 1.0866 1.0871 1.0912 1.0945 1.0968 1.0925 9.9773 12.0773 1.0697 1.0599 1.0587 1.0584 1.0588 1.0591 1.0593 1.0595 1.0595 1.0593 1.0590 1.0585 1.0366 1.0719 1.0959 1.0963 1.0965 1.0965 1.0989 1.1021 1.1039 1.0645 1.0845 1.1046 1.1048 1.1047 1.1044 1.0611 1.0983 1.1007 1.0993 1.1027 1.1095 1.0651
irintensity: 0.2425 0.6268 0.0701 4.8560 0.5227 0.3880 0.5172 0.2747 0.5945 1.5727 1.7202 0.1013 0.1774 0.5618 0.1462 0.0145 4.3892 0.2480 2.4050 0.5957 1.0279 7.9996 1.5694 0.0005 0.4623 1.0208 2.3377 1.7687 4.7235 1.3952 0.9481 0.3900 1.5796 60.1716 45.2361 6.8472 9.8324 11.8582 0.5883 4.4142 10.0546 2.0704 17.3860 1.5836 10.9541 1.9266 0.0750 1.7652 0.7373 2.0396 2.4738 1.0709 2.5775 4.8068 17.6545 16.1534 28.7288 6.7346 14.9501 24.3530 14.2583 45.4987 13.5645 10.5541 17.7748 25.0428 5.6471 3.9098 96.0181 5.3093 22.5804 6.3745 1.1682 1.4028 0.3773 1.6314 7.9975 10.4197 65.8907 39.9279 182.9437 0.6219 29.4723 39.1728 5.4198 7.9432 1.2752 12.9912 6.9311 7.5715 6.0837 2.7698 0.1697 2.3813 0.8482 0.3442 1.6355 1.9286 0.5201 0.2017 0.9255 1.8701 2.3241 1.6130 0.7449 3.5730 1.5196 0.4103 0.6048 0.1616 4.3042 11.3308 0.0143 0.0035 0.3568 0.0433 2.3854 1.2229 0.0663 0.5127 1.6083 12.2351 10.6287 4.2146 8.9152 0.8608 1.0214 36.4885 17.9071 232.5884 240.3838 29.6087 18.1026 0.2411 0.4900 1.7136 3.2778 2.1243 1.2101 1.7303 5.7791 107.9716 254.5485 37.4700 15.8979 0.5928 1.8375 3.6068 5.8925 4.1269 0.8879 1.4153 11.0727 24.4725 0.1979 14.1039 1.9870 335.7812 27.3184 32.9904 100.9709 55.8588 14.9404 15.5821 23.0527
temp: 298.150 k
press: 1.00000 atm
elementType: 8 8 8 8 6 6 6 6 6 6 6 6 6 6 6 6 6 6 6 6 6 6 6 1 1 1 1 1 1 1 1 1 1 1 1 1 1 1 1 1 1 1 1 1 1 1 1 1 1 1 1 1 1 1 1 1 1
symmnumber: 1
zpe: 1310047.4 jmol-1
zpe.correction: 0.498971 hartree
zpe.thermalcorrener: 0.526692 hartree
zpe.thermalcorrenthalpy: 0.527637 hartree
zpe.thermalcorrgfe: 0.436154 hartree
zpe.sumelectzpe: -1043.458168 hartree
zpe.sumelectthermal: -1043.430446 hartree
zpe.sumelectthermalent: -1043.429502 hartree
zpe.sumelectthermalfe: -1043.520984 hartree
dipole: 1.3329 0.9575 6.5634
dipole: 6.7655
quadrupole: -150.9555 -153.8989 -148.5530
quadrupole: -3.4250 -42.1690 0.4037
quadrupole: 0.1803 -2.7631 2.5828 -3.4250 -42.1690 0.4037
hfenergy: -1043.9571386 hartree
pointgroup: C01 [X(C19H34O4)]
dipole: 0.5420687 0.6681523 -2.5188405 debye
polarizability: 289.7632849|-4.0270769|177.6797905|2.3673175|-0.5654754|184.7084361 unknown
InChI: InChI=1S/C19H34O4/c1-2-3-4-5-6-7-8-9-10-11-12-13-14-19(17(20)21)15-16-23-18(19)22/h20H,2-16H2,1H3
charge 0 multiplicity 1
57 atoms
O  -7.389864 1.334576 0.90714
O  -5.301433 1.14841 1.885661
O  -5.198775 -2.318569 -0.868433
O  -6.750057 -1.883595 0.753406
C  -5.74022 0.07764 -0.356961
C  -4.346095 0.457692 -0.926516
C  -6.919275 0.504154 -1.298162
C  -3.114557 0.042461 -0.083005
C  -1.788962 0.416854 -0.783456
C  -0.542744 0.037315 0.047393
C  -8.069155 0.80665 -0.314796
C  -6.0634 0.875739 0.947575
C  0.787656 0.377696 -0.661005
C  2.035634 0.006288 0.171208
C  -5.928902 -1.433808 -0.063789
C  3.366158 0.314631 -0.551877
C  4.615661 -0.050171 0.281038
C  5.945322 0.236582 -0.452492
C  7.19608 -0.124189 0.380351
C  8.524787 0.15038 -0.359798
C  9.776865 -0.207567 0.472316
C  11.104717 0.062028 -0.272095
C  12.350789 -0.295103 0.566991
H  -4.255244 0.052685 -1.961583
H  -4.328994 1.55768 -1.054037
H  -6.624169 1.418284 -1.844953
H  -7.19164 -0.270396 -2.034667
H  -3.174302 0.53977 0.901042
H  -3.121455 -1.047665 0.1225
H  -1.774446 1.508565 -0.984213
H  -1.731207 -0.082857 -1.774784
H  -0.568717 -1.049142 0.273474
H  -0.583458 0.558644 1.025709
H  -8.625545 -0.09859 -0.021073
H  -8.758029 1.59303 -0.656567
H  0.829032 -0.150998 -1.636681
H  0.812859 1.462905 -0.894138
H  2.007922 0.551693 1.137506
H  1.999295 -1.074221 0.423726
H  3.39483 -0.237186 -1.514965
H  3.401254 1.39366 -0.811293
H  4.595882 0.512677 1.237691
H  4.573139 -1.125751 0.553211
H  5.986971 1.311183 -0.728886
H  5.965491 -0.330106 -1.407099
H  7.181228 0.448761 1.331168
H  7.150437 -1.196676 0.664073
H  8.569707 1.222343 -0.645931
H  8.539822 -0.424802 -1.309442
H  9.766132 0.370445 1.420238
H  9.732041 -1.278549 0.76199
H  -4.539408 -1.848624 -1.443479
H  11.147516 1.131612 -0.563321
H  11.115408 -0.517617 -1.217839
H  12.347568 -1.366176 0.844967
H  13.285859 -0.092779 0.01267
H  12.379088 0.293101 1.50379
