program: Gaussian 09
title: 000223653
version: EM64L-G09RevD.01
frameworkgroup: C1[X(C10H6ClN3)]
method: RPBEPBE
basis: SDD
operation: Freq
keyword: #p
keyword: freq=noraman
keyword: PBEPBE/SDD
title: #p freq=noraman PBEPBE/SDD
converged: YES YES NO YES
title: Mulliken charges:
elementType: Cl N N N C C C C C C C C C C H H H H H H
charge: -0.040800 -0.411037 -0.009331 -0.015657 0.555770 -0.308054 -0.442976 -0.095805 -0.170962 -0.261524 -0.186378 0.254405 -0.229734 -0.264311 0.257996 0.240460 0.354055 0.242583 0.266543 0.264758
chargesum: 0.00000
title: Mulliken charges with hydrogens summed into heavy atoms:
elementType: Cl N N N C C C C C C C C C C
charge: -0.040800 -0.056982 -0.009331 -0.015657 0.555770 -0.050058 -0.202516 -0.095805 0.071621 0.005019 0.078381 0.254405 -0.229734 -0.264311
polarizability: 2.54839129e+02 1.26116962e+01 1.60748749e+02 4.10541516e-03 5.42080131e-04 5.07180868e+01
1716.lowfreq: -6.4561 -0.4240 0.0018 0.0020 0.0026 3.6736 10.1183 59.9145 63.3270
frequency: 10.0588 59.9094 63.3264 104.8892 151.3363 161.4026 179.5639 255.7142 276.4255 289.7488 312.1498 385.4349 421.3768 431.3477 462.0949 536.5500 559.7727 583.2142 593.1956 615.0523 676.2539 677.6761 730.8959 786.8776 801.2026 852.2726 888.8545 898.6976 923.5352 972.7611 979.0972 1075.1375 1096.9567 1180.4997 1187.3064 1226.8298 1288.6748 1333.4115 1343.8620 1376.8851 1421.5677 1469.2223 1485.0546 1587.9317 1610.7471 1642.5022 2154.8637 2175.9626 3133.4982 3161.0979 3175.3806 3186.3733 3193.0052 3472.3540
redmass: 8.4605 11.0152 6.1317 13.7460 11.5402 6.4862 5.0875 4.0055 7.1727 3.0388 8.7892 10.4553 6.6553 2.9784 9.2764 6.2623 4.7160 11.4636 7.7216 5.7989 7.4920 2.0276 1.5025 1.3838 6.8648 1.6532 1.4199 5.0585 1.3269 1.3403 5.7516 2.1630 1.5927 1.4916 2.2451 2.5499 1.3427 1.8628 2.1808 5.0582 3.0317 2.1078 2.5669 6.3758 6.6461 3.3682 12.6031 12.6203 1.0897 1.0928 1.0929 1.0975 1.0925 1.0758
irintensity: 1.0622 2.8806 2.9364 4.2499 0.8544 4.1795 0.0123 0.8118 0.2566 2.7879 0.3447 5.6084 4.0329 8.4080 0.9833 0.1698 0.4879 5.4504 7.0157 0.2239 28.1949 26.0854 36.6584 96.2694 11.1083 23.8943 2.0038 42.9529 49.3247 2.3668 6.8275 23.5931 1.2741 4.7457 1.5121 12.1366 1.2078 286.9730 3.7135 8.6808 6.9109 85.1203 52.1945 183.1590 222.4835 586.9507 56.5136 107.1192 7.6398 8.4718 1.8514 1.8469 3.4241 25.5621
temp: 298.150 k
press: 1.00000 atm
elementType: 17 7 7 7 6 6 6 6 6 6 6 6 6 6 1 1 1 1 1 1
symmnumber: 1
zpe: 356605.7 jmol-1
zpe.correction: 0.135824 hartree
zpe.thermalcorrener: 0.148545 hartree
zpe.thermalcorrenthalpy: 0.149489 hartree
zpe.thermalcorrgfe: 0.093866 hartree
zpe.sumelectzpe: -1007.981981 hartree
zpe.sumelectthermal: -1007.969260 hartree
zpe.sumelectthermalent: -1007.968316 hartree
zpe.sumelectthermalfe: -1008.023939 hartree
dipole: 6.0665 2.8930 0.0004
dipole: 6.7210
quadrupole: -118.4187 -92.5018 -90.6311
quadrupole: 2.6078 0.0018 0.0043
quadrupole: -17.9015 8.0154 9.8861 2.6078 0.0018 0.0043
hfenergy: -1008.1178053 hartree
pointgroup: C01 [X(C10H6Cl1N3)]
dipole: -2.5053634 -0.8456506 0.0002806 debye
dipolederiv: -0.3184401 0.2428312 -0.0000852 0.4120287 -0.6178126 0.0002104 -0.000151 0.0002096 -0.0577554 -2.0686685 -0.1182408 0.0000381 -1.2509633 -0.2534236 0.0000436 -0.0000245 -0.0000064 -0.2782898 -0.4421226 -0.118285 -0.0000059 -0.3106263 -0.3521024 -0.0000065 -0.0000291 -0.0000047 -0.238244 -0.2926881 0.025226 0.0000438 0.3516471 -0.3621997 -0.000117 0.0000193 -0.000006 -0.2384618 1.7883562 -0.0014192 -0.0000194 -0.1692592 0.1437828 -0.0000672 -0.0000296 -0.0000395 0.1129455 -0.4392486 0.0997455 -0.0000543 0.4287764 -0.2391398 0.0000022 -0.000117 0.0000161 -0.1491563 -0.5507679 -0.0076159 0.0000015 -0.2636163 -0.025168 -0.0000675 0.0000969 -0.0000728 -0.206278 0.4908368 -0.3337978 0.0000974 -0.7455931 1.0183671 -0.000403 0.0002596 -0.0003989 -0.0407515 0.3583087 -0.0657697 0.0000144 0.0134471 0.1709848 -0.000106 -0.0000847 -0.0001103 -0.1069373 -0.2315461 0.0500213 -0.0000288 0.2727352 -0.4146752 0.0001141 -0.0001154 0.0001157 -0.1353693 2.0360668 0.1607341 -0.000058 1.104953 0.1201969 0.0000104 -0.00022 -0.0000213 0.046008 -1.1843495 -0.1423013 0.0000164 0.225705 -0.0317077 0.0000025 0.0000935 0.0000067 0.0245438 0.4184682 0.3723524 0.0000276 0.6335165 0.2487703 0.0000019 0.0000852 -0.0000079 0.0475454 0.0768073 -0.180779 -0.0000591 -0.7157266 0.3462681 0.0001249 -0.0000955 0.0000482 0.0535105 0.0671384 -0.0703842 0.0000466 -0.0947419 0.0243946 0.0000746 0.0000755 0.00007 0.1747052 0.0297379 0.1030999 -0.0000296 0.0863219 -0.0170366 0.0000776 -0.0000201 0.0000763 0.1766074 0.130551 -0.0293965 0.0000014 0.0570325 0.146886 0.0000106 0.0001107 0.0000232 0.3171129 0.0248785 -0.0654009 0.0000316 -0.0840745 -0.0418529 0.0000812 0.0000509 0.000079 0.1586369 -0.0216269 0.008666 0.0000088 0.0215549 0.102471 0.000029 0.0000265 0.0000218 0.177915 0.1283084 0.070714 0.0000128 0.0268831 0.0329968 -0.0000156 0.0000687 0.0000012 0.1617128 unknown
polarizability: 256.4873677|1.1201599|159.1005054|-0.0003815|-0.0227458|50.7180915 unknown
InChI: InChI=1S/C10H6ClN3/c11-9-2-1-3-10(4-9)14-7-8(5-12)6-13/h1-4,7,14H
charge 0 multiplicity 1
20 atoms
Cl -3.944776 2.440084 -0.000779
N  0.339601 -0.613241 0.000175
N  4.329109 2.187331 0.000207
N  3.503031 -2.322877 0.000101
C  -1.076966 -0.482407 0.000205
C  -1.721248 0.781578 -0.00027
C  -1.850503 -1.672838 0.000705
C  -3.126438 0.815099 -0.000182
C  -3.257172 -1.598067 0.000749
C  -3.919347 -0.348859 0.000319
C  1.269917 0.387686 0.000186
C  2.648795 0.165794 0.000086
C  3.56449 1.265598 0.000164
C  3.151643 -1.176603 -0.000077
H  -1.165953 1.722415 -0.000751
H  -1.353602 -2.650112 0.001077
H  0.696847 -1.57629 0.00017
H  -3.847595 -2.519561 0.001137
H  -5.01011 -0.283486 0.000362
H  0.904079 1.41626 0.000318
