program: Gaussian 09
title: 000223633
version: EM64L-G09RevD.01
frameworkgroup: C1[X(C21H29NO)]
method: RPBEPBE
basis: SDD
operation: Freq
keyword: #p
keyword: freq=noraman
keyword: PBEPBE/SDD
title: #p freq=noraman PBEPBE/SDD
converged: YES YES NO NO
title: Mulliken charges:
elementType: O N C C C C C C C C C C C C C C C C C C C C C H H H H H H H H H H H H H H H H H H H H H H H H H H H H H
charge: -0.470595 -0.218730 -0.122795 -0.244687 -0.164706 0.414912 0.263958 0.285848 0.288463 -0.548477 -0.549374 -0.300355 -0.333779 -0.729527 -0.423202 -0.441846 -0.415962 -0.434618 -0.372615 -0.358450 -0.253048 -0.683177 -0.684157 0.240517 0.195495 0.230916 0.233563 0.233228 0.231799 0.194635 0.209734 0.193068 0.203186 0.217016 0.257678 0.208324 0.266799 0.236213 0.220988 0.239408 0.193780 0.218044 0.206628 0.211208 0.217211 0.356469 0.211108 0.207206 0.222870 0.207291 0.209225 0.223314
chargesum: 0.00000
title: Mulliken charges with hydrogens summed into heavy atoms:
elementType: O N C C C C C C C C C C C C C C C C C C C C C
charge: -0.114126 -0.218730 0.117722 -0.049192 -0.164706 0.414912 0.263958 0.285848 0.288463 -0.083999 -0.084348 0.104013 0.062475 -0.046509 -0.156404 -0.205633 -0.194974 -0.195210 0.039208 0.059387 -0.035836 -0.041993 -0.044327
polarizability: 3.11472769e+02 8.48142254e-01 2.54325306e+02 -1.45066817e+01 -2.35117548e+01 1.63843009e+02
1716.lowfreq: -4.5624 -0.0008 0.0000 0.0007 4.8557 6.4567 22.3375 29.5385 37.9854
frequency: 22.2183 29.5229 37.9474 54.4043 61.8887 67.1025 73.3893 79.4314 81.9811 140.7330 150.6431 173.6486 187.8309 189.9299 214.8867 222.1130 224.1050 230.4235 254.4660 260.8972 278.7746 289.3039 313.7509 339.7771 389.0541 418.6325 440.1498 449.8980 462.5961 471.7435 506.2702 512.9437 539.7825 561.7556 567.8038 594.5863 639.0662 650.6927 680.6896 740.8101 748.6629 752.4958 761.6376 781.3237 788.7653 795.8943 804.3689 836.7630 852.1579 863.8204 872.1376 875.9343 892.5644 900.1954 903.6633 906.6389 956.0588 964.6687 971.9671 974.2655 998.5788 1011.6835 1023.6314 1036.7295 1049.4572 1050.2448 1063.3025 1080.7505 1091.7568 1111.6154 1114.4610 1121.4150 1132.2225 1142.9769 1153.4902 1163.8202 1184.7347 1191.5731 1203.9703 1212.2794 1221.3881 1229.7385 1241.4745 1254.4024 1255.7748 1258.4446 1288.5046 1289.0538 1291.3056 1299.0702 1305.9619 1316.5438 1321.6422 1359.5588 1365.5373 1369.6638 1370.0959 1385.1067 1389.8251 1391.2324 1392.5605 1403.8183 1419.5179 1444.8671 1459.4918 1466.6171 1467.6944 1469.4131 1473.6862 1474.9068 1475.1341 1477.4973 1478.2079 1478.9719 1481.6399 1488.1851 1490.3678 1510.6303 1601.0598 1607.3838 1620.9366 2897.1206 2902.6968 2924.1942 2973.9677 2974.4901 2983.5169 2984.5137 2986.9040 2987.8340 3001.3630 3013.9409 3018.7956 3023.2845 3030.3911 3040.5054 3043.9536 3053.0583 3070.2364 3071.6823 3073.6145 3077.2251 3078.3596 3078.4516 3089.8133 3119.3039 3126.8436 3137.6197 3153.4641 3155.3223
redmass: 4.0747 3.8807 4.0500 2.5892 2.3120 3.7158 2.2275 1.7933 2.0304 3.2212 3.2157 4.4663 2.7587 4.3636 1.1687 2.8634 1.5853 1.8468 1.0830 2.2859 3.8784 2.8924 3.0083 3.9976 3.2734 3.4550 4.6223 3.8288 3.3242 3.5417 3.7507 5.8136 3.9633 3.4756 5.1999 2.8595 5.3435 3.6847 5.4575 1.2179 1.1041 1.8163 3.1238 1.4991 1.7477 1.4226 3.3247 2.3293 1.8167 1.4776 1.4362 1.2664 1.7124 1.4958 1.9001 2.4153 3.2452 1.3932 2.1516 1.3370 5.4359 1.9449 4.0998 2.8941 2.7026 1.9830 2.3008 2.4276 2.2523 2.4134 2.1698 2.5069 2.1257 1.1753 2.2031 1.7968 1.2770 2.1600 1.1024 1.5368 1.2774 1.6501 1.5311 1.3808 1.3498 1.8887 1.2852 1.5635 1.1207 1.2774 1.3512 1.3739 1.3675 1.4468 1.4018 1.6298 1.9131 1.6171 1.2398 1.2302 1.3641 1.9600 2.0402 1.1930 2.9944 1.2386 1.1753 1.0704 1.1932 1.2002 1.6045 1.0579 1.0426 1.0439 1.0557 1.0806 1.0864 4.3849 6.6121 8.3127 7.6207 1.0693 1.0695 1.0817 1.0359 1.0358 1.0391 1.0581 1.0604 1.0591 1.0618 1.0843 1.0902 1.0912 1.1027 1.1003 1.0984 1.1024 1.0981 1.1002 1.0982 1.0767 1.0926 1.0974 1.0975 1.0857 1.0890 1.0917 1.0938 1.0971
irintensity: 0.2169 0.1550 0.4183 0.4156 0.2925 1.6371 0.6816 0.0582 0.1231 0.8562 0.6082 0.0898 2.3072 4.6869 0.3965 6.2175 1.2689 1.9169 0.4462 0.4429 3.0365 0.3693 1.4148 4.8169 2.7802 8.2909 2.9588 1.4627 0.1787 0.3296 1.4717 2.1103 3.9191 3.1717 4.0798 0.7614 2.9689 0.7811 14.5973 7.6305 7.5121 11.3603 8.0365 35.4469 4.0917 57.5582 10.0023 2.2798 50.5003 11.8491 6.7119 3.7271 2.5305 5.6790 9.1197 1.7997 1.3083 3.6772 22.1931 0.4936 41.4545 0.0883 18.7124 22.0724 4.2558 13.2079 24.9791 31.1758 5.2483 40.3010 6.4291 16.1896 33.4519 0.4415 11.8624 14.0366 0.8205 15.5155 0.0028 7.0736 0.0280 3.7536 2.1446 8.7786 3.6342 0.9464 2.7622 3.4947 2.9552 14.8427 0.3764 6.6630 4.1114 21.8146 0.7458 15.5944 5.0355 39.7309 24.4714 24.2117 4.7409 40.3995 23.3047 5.2773 4.9987 6.5124 7.1420 1.2166 0.7225 4.3552 2.6902 3.1687 13.7478 10.7825 10.6209 26.9836 11.9793 5.6278 5.7379 19.6995 10.8773 23.3223 117.6705 40.3582 49.3662 37.9167 8.7995 33.7797 30.4007 20.4457 65.2681 8.4882 7.3184 11.0917 0.1211 9.7736 14.0611 33.3276 44.2752 38.9154 48.4148 270.0859 157.9482 61.2148 56.0735 4.4616 15.6887 27.6582 15.0354 28.8309
temp: 298.150 k
press: 1.00000 atm
elementType: 8 7 6 6 6 6 6 6 6 6 6 6 6 6 6 6 6 6 6 6 6 6 6 1 1 1 1 1 1 1 1 1 1 1 1 1 1 1 1 1 1 1 1 1 1 1 1 1 1 1 1 1
symmnumber: 1
zpe: 1180760.3 jmol-1
zpe.correction: 0.449728 hartree
zpe.thermalcorrener: 0.473158 hartree
zpe.thermalcorrenthalpy: 0.474102 hartree
zpe.thermalcorrgfe: 0.395638 hartree
zpe.sumelectzpe: -945.872349 hartree
zpe.sumelectthermal: -945.848919 hartree
zpe.sumelectthermalent: -945.847975 hartree
zpe.sumelectthermalfe: -945.926439 hartree
dipole: 1.0762 -0.0472 3.0350
dipole: 3.2205
quadrupole: -117.1518 -131.5555 -148.7428
quadrupole: -3.6305 1.3422 -1.0434
quadrupole: 15.3316 0.9278 -16.2594 -3.6305 1.3422 -1.0434
hfenergy: -946.3220768 hartree
pointgroup: C01 [X(C21H29N1O1)]
dipole: 0.4458579 -0.0536115 -1.1847753 debye
polarizability: 310.7012309|4.1687723|250.2147303|18.4466962|-29.5208266|168.7251222 unknown
InChI: InChI=1S/C21H29NO/c1-4-13-22(14-5-2)15(3)21(23)19-12-11-17-10-9-16-7-6-8-18(19)20(16)17/h6-8,11-12,15,21,23H,4-5,9-10,13-14H2,1-3H3
charge 0 multiplicity 1
52 atoms
O  1.461378 -0.10154 1.822893
N  3.085761 0.154617 -0.209868
C  1.647441 -0.027715 -0.608631
C  0.758229 0.377252 0.633133
C  -3.013705 -0.219345 -0.016962
C  -0.637229 -0.231426 0.568346
C  -1.766094 0.483508 0.018311
C  -3.192681 -1.550476 0.458985
C  -4.226932 0.334902 -0.523345
C  -4.651714 -1.960738 0.264485
C  -5.340976 -0.703971 -0.394934
C  3.581614 1.56073 -0.2551
C  4.002457 -0.839302 -0.838522
C  1.237713 0.66723 -1.923292
C  -0.829988 -1.539509 1.050043
C  -2.093081 -2.216097 1.003257
C  -1.795268 1.829265 -0.492824
C  -4.221828 1.640562 -1.015315
C  4.704924 1.830318 0.769923
C  4.002298 -2.204451 -0.116367
C  -2.988182 2.377493 -0.987523
C  5.214516 3.286075 0.695767
C  4.927522 -3.226525 -0.811338
H  1.510737 -1.119292 -0.731012
H  0.683257 1.487095 0.667904
H  -4.739175 -2.853212 -0.38328
H  -5.129293 -2.220718 1.227767
H  -6.172401 -0.327218 0.229721
H  -5.774109 -0.954016 -1.381643
H  3.933504 1.839596 -1.276499
H  2.733174 2.230092 -0.018012
H  3.752743 -0.989406 -1.915933
H  5.028484 -0.427271 -0.812495
H  1.886757 0.342656 -2.757898
H  0.196347 0.412182 -2.184323
H  1.304216 1.767845 -1.847923
H  0.031207 -2.032245 1.513734
H  -2.176189 -3.234177 1.400491
H  -0.8877 2.442193 -0.490416
H  -5.128469 2.111158 -1.412235
H  5.549951 1.134796 0.599256
H  4.316008 1.612981 1.783229
H  2.971271 -2.606327 -0.07299
H  4.31992 -2.04866 0.932493
H  -2.983479 3.40744 -1.363924
H  2.424758 -0.133827 1.491083
H  4.396949 4.00502 0.892633
H  5.631251 3.51523 -0.303437
H  6.008452 3.46823 1.44204
H  5.971915 -2.862365 -0.847629
H  4.60267 -3.419128 -1.851487
H  4.926969 -4.192107 -0.274633
