program: Gaussian 09
title: 000018995
version: EM64L-G09RevD.01
frameworkgroup: C1[X(C16H24O5)]
method: RPBEPBE
basis: SDD
operation: Freq
keyword: #pfreq=noraman
keyword: PBEPBE/SDD
title: #p freq=noraman PBEPBE/SDD
converged: YES YES NO NO
title: Mulliken charges:
elementType: O O O O O C C C C C C C C C C C C C C C C H H H H H H H H H H H H H H H H H H H H H H H H
charge: -0.328153 -0.252552 -0.455723 -0.449528 -0.242651 -0.349108 -0.408147 -0.339623 -0.237953 -0.356037 -0.143957 -0.307388 -0.325822 -0.694605 0.277794 0.106824 -0.343038 -0.294155 -0.220897 -0.245105 0.111163 0.209461 0.183684 0.207229 0.193212 0.187052 0.180601 0.196677 0.193412 0.195379 0.195101 0.238959 0.274443 0.208240 0.231175 0.232851 0.209322 0.209473 0.215428 0.355275 0.256497 0.280295 0.230871 0.234759 0.379265
chargesum: 0.00000
title: Mulliken charges with hydrogens summed into heavy atoms:
elementType: O O O O O C C C C C C C C C C C C C C C C
charge: -0.328153 -0.252552 -0.100448 -0.070263 -0.242651 0.044037 -0.007706 0.028031 0.152136 0.034442 0.095002 0.175295 0.138204 -0.060383 0.277794 0.106824 -0.086542 -0.013860 0.009974 -0.010346 0.111163
polarizability: 1.81582338e+02 -2.52382473e+01 2.07453626e+02 -1.73427269e+01 -1.68159825e+01 1.86781361e+02
1716.lowfreq: -9.0853 -3.4437 -0.0006 0.0003 0.0009 4.4087 8.5406 15.9009 22.1422
frequency: 7.8676 15.6412 21.7409 35.1215 45.0961 50.9270 67.1694 82.0030 91.8649 114.8852 126.4261 129.0901 137.8537 168.8772 180.3902 196.7237 230.8855 232.4537 243.4376 261.2371 278.9568 308.9548 340.0244 367.6327 403.5139 415.7544 423.6345 450.4304 509.9448 520.6854 527.8873 540.5283 578.2272 580.6782 603.8468 612.8683 683.7513 721.5690 723.3965 745.0384 762.3313 775.0118 808.2482 810.8574 855.6947 864.1494 879.6644 889.3509 892.9259 931.7088 959.1073 963.4748 964.3070 982.1915 990.8225 998.4196 1009.7536 1028.6970 1045.3062 1050.0679 1077.5951 1084.2584 1091.7831 1115.8469 1120.1135 1131.1699 1142.7378 1159.0470 1176.2598 1183.2042 1197.5546 1214.8044 1223.3769 1239.9793 1247.8824 1253.6667 1267.9747 1272.7414 1283.9914 1293.1732 1301.7730 1311.3416 1329.5610 1338.7608 1351.9872 1362.4349 1363.5805 1386.7480 1391.3181 1392.7109 1397.3636 1430.9881 1450.4126 1461.6775 1464.6134 1468.2551 1469.8413 1478.3670 1480.5202 1483.5960 1487.8182 1488.2007 1580.9501 1602.4757 1642.8817 2927.3581 2951.0407 2957.4538 2963.5123 2969.0547 2971.5456 2971.9671 2985.2140 2986.8704 2991.8353 3015.3185 3027.1007 3035.1311 3049.7176 3052.9413 3067.8588 3070.8058 3072.8318 3135.5704 3158.3739 3172.7339 3185.5383 3476.5902 3531.2885
redmass: 5.0434 5.1355 3.9356 4.8731 11.4169 1.7658 3.7341 5.6661 3.1126 3.1260 3.7137 2.8389 2.7631 2.8050 2.9509 5.6468 2.8958 1.2086 5.2315 2.3863 5.2588 5.5191 2.8772 6.5584 3.2238 3.3199 2.7754 5.0592 2.3188 3.2993 1.1636 4.8346 1.6607 2.6407 5.5969 2.7338 3.8673 4.8226 1.1000 1.2091 1.9544 2.1378 3.8971 1.6920 2.9213 1.5507 2.1703 1.8913 1.5760 2.0355 1.7996 4.0955 1.5612 5.1168 1.3578 1.8099 2.1093 3.0678 2.2734 2.6607 2.3147 2.0080 2.4035 1.8480 2.2364 1.8817 1.8281 1.6574 1.0878 1.1175 1.4682 1.2709 1.3489 3.0571 1.3194 1.2722 1.2377 1.6720 1.0445 1.1299 2.2829 1.3381 1.2592 1.2360 1.5773 1.6535 1.4404 3.0195 1.2227 1.8546 1.4238 2.3018 1.0822 1.2443 1.0703 1.0892 1.0744 1.0422 1.0738 1.7889 1.1343 1.0878 7.0748 6.3333 8.3640 1.0556 1.0590 1.0590 1.0618 1.0603 1.0386 1.0745 1.0549 1.0908 1.0953 1.0980 1.1025 1.1048 1.1032 1.1000 1.1007 1.0992 1.0962 1.0869 1.0912 1.0946 1.0973 1.0648 1.0641
irintensity: 0.0083 0.2580 1.2688 0.6592 0.8636 0.0903 0.6322 0.7856 0.4024 2.1176 2.4044 2.7750 0.2137 2.6771 10.7465 2.8231 3.6605 0.5762 0.1333 0.7924 1.4929 4.5078 1.2834 5.3760 3.8209 13.1800 2.8182 9.4330 16.0279 4.3201 111.8410 8.7075 80.5313 56.2777 26.3066 1.6145 50.6774 5.6134 10.3253 0.5498 79.1040 15.9366 4.9949 0.6716 18.1196 1.1787 3.9283 5.3804 1.8601 11.8005 5.3713 178.6867 9.3927 223.5780 4.9479 48.2672 69.5482 2.0069 16.6404 66.5319 1.0643 18.3079 75.5351 56.7186 13.4790 9.9077 0.6934 115.3280 5.4035 6.4368 0.5365 8.5327 59.7170 136.3791 12.9809 3.5675 2.0129 55.1764 1.0393 2.7645 67.9067 0.3220 6.0209 17.1442 0.2709 1.4598 8.6562 6.8150 10.9851 34.6859 12.3637 32.1444 6.8348 63.6639 0.7222 17.6501 2.7474 12.0290 4.0022 49.6696 21.9453 20.4331 52.9036 12.7903 372.3378 52.5368 11.9829 66.6205 1.5287 56.9111 34.0601 37.8397 25.8538 91.6282 17.8276 14.3111 4.8104 12.5424 81.6634 8.1071 100.0977 49.7279 51.0096 5.5160 16.5674 8.6350 7.2175 36.1921 40.4776
temp: 298.150 k
press: 1.00000 atm
elementType: 8 8 8 8 8 6 6 6 6 6 6 6 6 6 6 6 6 6 6 6 6 1 1 1 1 1 1 1 1 1 1 1 1 1 1 1 1 1 1 1 1 1 1 1 1
symmnumber: 1
zpe: 984898.0 jmol-1
zpe.correction: 0.375128 hartree
zpe.thermalcorrener: 0.398254 hartree
zpe.thermalcorrenthalpy: 0.399198 hartree
zpe.thermalcorrgfe: 0.317695 hartree
zpe.sumelectzpe: -998.563358 hartree
zpe.sumelectthermal: -998.540231 hartree
zpe.sumelectthermalent: -998.539287 hartree
zpe.sumelectthermalfe: -998.620791 hartree
dipole: 0.8213 2.1532 0.8730
dipole: 2.4643
quadrupole: -122.5716 -128.3168 -119.7776
quadrupole: -6.1854 1.6057 -10.2165
quadrupole: 0.9838 -4.7615 3.7778 -6.1854 1.6057 -10.2165
hfenergy: -998.9384856 hartree
pointgroup: C01 [X(C16H24O5)]
dipole: -0.9424924 -0.0684677 0.2169036 debye
polarizability: 176.9409064|27.2778329|205.7806848|20.7266452|-5.0188342|193.0957332 unknown
InChI: InChI=1S/C16H24O5/c1-2-3-4-7-10-20-11-13(17)12-21-15-9-6-5-8-14(15)16(18)19/h5-6,8-9,13,17-18H,2-4,7,10-12H2,1H3
charge 0 multiplicity 1
45 atoms
O  1.208377 2.248223 0.224834
O  1.68695 -1.243535 -0.30823
O  3.092087 1.878238 -1.708366
O  0.914199 -4.037537 2.76389
O  1.632603 -1.873244 2.368104
C  -1.755488 2.801642 0.42994
C  -0.606731 3.731227 0.87976
C  -2.992006 3.573914 -0.080773
C  0.633338 2.975617 1.368054
C  -4.14965 2.647768 -0.518415
C  2.861647 0.812003 -0.725593
C  2.358064 1.401132 0.598106
C  1.864475 -0.193988 -1.331468
C  -5.384211 3.423793 -1.026238
C  0.786097 -2.272111 -0.52779
C  0.521416 -3.156355 0.570122
C  0.154939 -2.492569 -1.780148
C  -0.341188 -4.266043 0.357703
C  -0.708768 -3.592026 -1.953749
C  -0.955392 -4.489852 -0.888631
C  1.085233 -2.910885 1.921821
H  -1.380978 2.126004 -0.363594
H  -2.052916 2.151788 1.279673
H  -0.311806 4.397644 0.044829
H  -0.95692 4.387095 1.703144
H  -2.696745 4.218629 -0.935229
H  -3.354834 4.259841 0.71409
H  1.394725 3.67631 1.776763
H  0.364141 2.248095 2.164797
H  -4.441302 2.002341 0.335157
H  -3.787732 1.964485 -1.313677
H  3.833182 0.315348 -0.564414
H  2.053121 0.595784 1.294318
H  3.149805 2.027786 1.06016
H  0.894122 0.298962 -1.53542
H  2.281694 -0.618096 -2.26429
H  -5.787893 4.087072 -0.237769
H  -5.123512 4.057731 -1.894952
H  -6.194128 2.738979 -1.338478
H  2.366821 2.543887 -1.552034
H  0.345029 -1.815675 -2.617431
H  -0.524809 -4.939141 1.198818
H  -1.186385 -3.749665 -2.927307
H  -1.621438 -5.346709 -1.028195
H  1.281467 -3.80371 3.658106
