program: Gaussian 09
title: 000223626
version: EM64L-G09RevD.01
frameworkgroup: C1[X(C16H21NO3)]
method: RPBEPBE
basis: SDD
operation: Freq
keyword: #p
keyword: freq=noraman
keyword: PBEPBE/SDD
title: #p freq=noraman PBEPBE/SDD
converged: YES YES NO NO
title: Mulliken charges:
elementType: O O O N C C C C C C C C C C C C C C C C H H H H H H H H H H H H H H H H H H H H H
charge: -0.218869 -0.418771 -0.213783 -0.393021 -0.124838 -0.436184 -0.174555 -0.445948 0.109518 -0.371566 0.556705 -0.355992 0.175900 -0.453533 -0.376699 -0.358349 -0.227146 -0.238719 -0.696294 -0.244476 0.295268 0.252807 0.271200 0.220200 0.197745 0.332874 0.217339 0.184536 0.187442 0.192350 0.227411 0.233161 0.200422 0.193881 0.224862 0.224679 0.384666 0.209259 0.217021 0.211193 0.228308
chargesum: 0.00000
title: Mulliken charges with hydrogens summed into heavy atoms:
elementType: O O O N C C C C C C C C C C C C C C C C
charge: -0.218869 -0.034105 -0.213783 -0.060147 0.170430 -0.183377 0.096644 -0.028002 0.109518 0.030309 0.556705 0.023800 0.175900 -0.226122 -0.143538 0.035954 -0.002284 -0.014040 -0.058822 -0.016169
polarizability: 1.98636923e+02 -2.26524007e+01 1.94933103e+02 6.40774358e+00 3.02802768e+00 1.53383976e+02
1716.lowfreq: -8.0970 -4.7432 -0.0011 -0.0007 -0.0005 1.9722 15.8664 20.0655 23.1785
frequency: 15.4547 20.0461 23.0748 30.9389 44.6682 55.2132 71.2646 90.7765 114.7156 133.7357 138.2781 167.6277 193.8395 206.3365 233.5815 236.3329 265.1200 295.7688 320.3554 400.4932 402.7222 431.8424 443.6162 475.1788 496.7232 544.0037 579.1005 604.3609 613.8393 623.3328 630.5599 659.6200 674.9710 703.8691 722.2993 745.3445 753.6102 766.3530 820.3390 836.1180 850.6232 880.1540 889.8654 908.6965 927.9089 934.9845 974.1731 983.8623 991.4866 994.1727 1004.6508 1027.4432 1046.2515 1053.3951 1056.7987 1071.7572 1079.1532 1085.0076 1105.1423 1115.4803 1137.6867 1172.3157 1189.4095 1193.7971 1201.8281 1211.0550 1224.1951 1241.9872 1249.2687 1262.5557 1265.9926 1280.3186 1287.5016 1292.2619 1299.0685 1313.0917 1333.7563 1340.0911 1349.8452 1356.2772 1360.4584 1384.8097 1388.8683 1389.1208 1443.2245 1458.2818 1462.1155 1469.9637 1477.7983 1479.3460 1485.1743 1486.9931 1594.3894 1615.5608 1663.9700 1672.5786 2950.4832 2952.0125 2957.4964 2961.2299 2968.2136 2970.2565 2972.0061 2992.1063 3003.2889 3013.5131 3023.9288 3041.0777 3068.3302 3071.8800 3115.3103 3118.5628 3132.7462 3145.0117 3163.0084 3510.0178 3562.2786
redmass: 4.3086 5.0646 6.2958 3.1835 2.3772 3.4546 4.0403 7.4061 3.2974 2.2594 3.0549 4.0785 3.4213 4.2672 1.1172 5.2754 5.8052 5.2616 3.6701 3.4392 2.8281 3.4800 5.3570 3.4740 3.3903 2.8545 3.4963 2.2776 3.8578 3.2107 1.9462 2.3120 3.4571 1.6838 1.0735 1.8813 1.9213 1.9678 1.4159 4.8516 1.2506 3.0061 1.8261 1.6817 3.6128 1.8439 1.3916 1.6229 4.5323 1.4535 3.6913 2.1845 2.9336 2.1644 2.9283 2.2523 1.9421 1.9536 2.1286 2.2066 2.2970 1.0556 1.1153 1.4888 1.6360 1.6876 1.7480 1.6093 1.3282 1.5419 1.4066 1.4985 1.0781 1.3133 1.2355 1.4934 1.4416 1.3839 1.5501 1.5860 1.5594 7.1996 1.7754 1.2805 2.1716 1.0775 1.0728 1.0779 1.0423 1.0783 2.3550 1.0850 6.0712 6.1794 9.1906 9.2546 1.0610 1.0601 1.0636 1.0822 1.0601 1.0814 1.0366 1.0952 1.0910 1.0929 1.0997 1.1029 1.1008 1.0992 1.0874 1.0870 1.0908 1.0958 1.1015 1.0641 1.0786
irintensity: 0.5043 0.5238 1.2013 0.1508 0.1788 0.0055 1.0901 1.4077 1.3156 0.1423 0.4333 0.6208 1.5567 1.1713 0.0014 0.3779 2.9771 2.2262 1.7739 2.4638 0.0491 3.9627 21.5385 5.9932 5.8934 30.4016 6.1075 43.8682 18.7228 30.3260 59.1107 106.6151 54.2920 55.2404 10.9274 1.8289 1.4834 37.2627 5.6712 1.2716 0.1097 5.9833 2.2551 0.9421 12.2367 6.0195 0.1334 20.0304 1.7599 0.0291 1.4890 11.8067 102.0959 221.8545 3.6092 24.8731 7.9776 4.8405 18.3992 2.7137 8.2792 0.0718 0.0777 4.6352 56.1954 1.2538 42.3896 36.4555 3.8416 21.1849 5.4643 14.9091 0.5625 0.8805 0.3904 1.9290 1.0760 0.6415 10.5411 6.3782 12.3465 0.0559 11.2158 9.0003 8.4495 0.4255 0.3396 0.6697 12.4411 4.2479 17.2611 17.8008 1.2786 4.5543 401.0968 148.8821 1.4109 8.2493 29.3893 31.2004 85.0579 15.0453 36.1150 5.5833 5.9201 7.3365 0.3994 88.9054 89.0995 51.8535 8.8262 5.8423 12.3159 38.4842 23.8824 30.5938 37.7750
temp: 298.150 k
press: 1.00000 atm
elementType: 8 8 8 7 6 6 6 6 6 6 6 6 6 6 6 6 6 6 6 6 1 1 1 1 1 1 1 1 1 1 1 1 1 1 1 1 1 1 1 1 1
symmnumber: 1
zpe: 892977.3 jmol-1
zpe.correction: 0.340117 hartree
zpe.thermalcorrener: 0.360439 hartree
zpe.thermalcorrenthalpy: 0.361383 hartree
zpe.thermalcorrgfe: 0.286646 hartree
zpe.sumelectzpe: -901.249944 hartree
zpe.sumelectthermal: -901.229622 hartree
zpe.sumelectthermalent: -901.228678 hartree
zpe.sumelectthermalfe: -901.303415 hartree
dipole: -4.0967 0.0168 0.1476
dipole: 4.0994
quadrupole: -131.9354 -105.9372 -120.0045
quadrupole: -14.2867 9.3798 5.8341
quadrupole: -12.6430 13.3552 -0.7122 -14.2867 9.3798 5.8341
hfenergy: -901.590061 hartree
pointgroup: C01 [X(C16H21N1O3)]
dipole: 1.5884472 -0.1473448 0.2374524 debye
polarizability: 196.099922|-22.0562211|198.9284937|-3.0552577|-2.0215049|151.9255869 unknown
InChI: InChI=1S/C16H21NO3/c1-2-3-5-10-12-13(11-8-6-4-7-9-11)15(18)17-14(12)16(19)20/h4,6-9,12-14,17,19H,2-3,5,10H2,1H3
charge 0 multiplicity 1
41 atoms
O  -2.784318 -1.737259 -1.756674
O  1.32565 -4.107655 0.353957
O  1.081586 -2.407021 1.919628
N  -0.690362 -2.492952 -0.999931
C  0.31097 -0.482767 -0.192402
C  -0.961975 -0.142598 -1.037174
C  0.598899 -1.984862 -0.498557
C  1.501273 0.454418 -0.482069
C  -1.632535 -1.514278 -1.30525
C  2.759948 0.176288 0.371969
C  -1.872724 0.897925 -0.406346
C  3.884829 1.206776 0.127489
C  1.022909 -2.791187 0.735668
C  -1.970064 2.198607 -0.958271
C  -2.618217 0.596258 0.762757
C  5.160696 0.921868 0.952554
C  -2.78721 3.18208 -0.355447
C  -3.436624 1.574139 1.366275
C  6.275922 1.962664 0.714977
C  -3.522298 2.872943 0.810953
H  0.051281 -0.408299 0.881022
H  -0.639458 0.231322 -2.031728
H  1.39661 -2.099093 -1.262101
H  1.168319 1.496464 -0.301471
H  1.764707 0.391056 -1.559818
H  -0.853481 -3.482437 -1.19421
H  2.48303 0.172365 1.445119
H  3.151439 -0.839663 0.151849
H  4.144222 1.224692 -0.952178
H  3.510149 2.222379 0.373543
H  -1.409669 2.441113 -1.870055
H  -2.570839 -0.411887 1.193075
H  4.89853 0.896647 2.029763
H  5.53818 -0.090548 0.701236
H  -2.853403 4.182823 -0.797084
H  -4.012572 1.324512 2.264545
H  1.564937 -4.64544 1.157339
H  6.576398 1.986571 -0.349708
H  7.176355 1.735932 1.314921
H  5.934839 2.978851 0.989162
H  -4.159925 3.631456 1.278674
