program: Gaussian 09
title: 000223610
version: EM64L-G09RevD.01
frameworkgroup: C1[X(C6H14N2O3S)]
method: RPBEPBE
basis: SDD
operation: Freq
keyword: #p
keyword: freq=noraman
keyword: PBEPBE/SDD
title: #p freq=noraman PBEPBE/SDD
converged: YES YES NO NO
title: Mulliken charges:
elementType: S O O O N N C C C C C C H H H H H H H H H H H H H H
charge: 1.038889 -0.240015 -0.530031 -0.529269 -0.336139 -0.273927 -0.339450 -0.349031 -0.302510 -0.299310 -0.589918 -0.597647 0.244205 0.251875 0.266529 0.231955 0.229941 0.202862 0.203192 0.231307 0.237455 0.265441 0.235993 0.280328 0.223190 0.244084
chargesum: 0.00000
title: Mulliken charges with hydrogens summed into heavy atoms:
elementType: S O O O N N C C C C C C
charge: 1.038889 -0.240015 -0.530031 -0.529269 -0.336139 -0.273927 0.156630 0.149454 0.130293 0.135190 0.148971 0.149954
polarizability: 1.45763577e+02 5.44318175e+00 1.10463764e+02 6.70879006e-01 1.73452749e+00 1.02822473e+02
1716.lowfreq: -16.7979 -13.0426 -0.0011 0.0021 0.0022 8.2626 38.7983 60.1750 73.8853
frequency: 38.3632 60.0035 73.7631 116.3203 160.4356 181.5758 191.1496 198.2362 220.5632 234.8701 250.4042 271.6347 306.1648 324.2654 382.8173 388.0256 410.1563 421.9973 454.9924 482.9846 546.5904 628.5121 791.2401 808.6685 832.9675 840.9853 852.9204 890.4603 937.6369 988.0646 1008.9359 1026.0803 1048.9038 1059.9608 1078.6027 1102.0145 1113.9937 1120.5870 1155.1675 1182.5926 1205.4451 1235.9463 1261.1395 1272.7905 1315.0157 1335.5273 1341.1793 1364.7867 1405.7511 1418.4059 1442.2152 1449.1575 1450.0106 1451.6409 1462.7455 1465.7906 1466.7013 1479.5627 2948.4815 2956.4875 2959.4202 2965.8911 2972.6455 2975.3935 3051.4571 3054.9417 3076.2192 3082.4820 3090.5623 3093.0199 3103.1401 3108.9022
redmass: 3.3723 3.8585 3.1369 4.9200 3.0841 3.5727 1.1733 5.6892 1.5395 1.9197 3.2428 3.5606 4.5008 2.9772 2.9617 4.7873 2.7487 4.2796 3.0335 5.8130 8.1587 2.0659 4.1816 12.3978 3.9482 1.5954 4.3709 2.4070 11.9099 2.7037 1.5292 2.1000 4.0693 2.1930 1.2280 2.0990 1.4281 4.6016 3.9919 1.0649 1.6629 1.3043 1.2619 1.2013 1.2501 1.2117 1.2505 1.2453 1.1270 1.1373 1.0791 1.0506 1.0819 1.0827 1.0489 1.0722 1.0621 1.0536 1.0396 1.0391 1.0670 1.0673 1.0642 1.0621 1.0952 1.0954 1.0980 1.0965 1.0978 1.0996 1.0990 1.0993
irintensity: 1.2839 0.8442 0.5471 3.1149 4.3828 4.6831 0.9322 14.7644 1.8098 2.5050 18.5481 5.2291 6.2209 8.7133 2.9266 7.9943 1.3528 16.7647 3.5682 35.1527 79.8997 7.5444 7.0392 72.0999 66.4979 2.3923 37.6558 4.4720 88.5322 23.1498 2.7199 12.2944 55.6467 3.1537 0.2791 31.5275 15.3823 0.5437 11.9305 1.5363 13.3511 45.7110 9.3606 22.7266 0.3345 2.8483 8.0965 5.3098 23.3481 2.5548 2.0962 10.4890 31.0780 4.5826 1.5991 13.2990 15.8279 23.6492 65.7915 65.0674 36.6673 37.0139 39.4439 70.8076 13.6659 19.4020 12.2258 8.2837 21.8207 25.9848 1.7993 7.5214
temp: 298.150 k
press: 1.00000 atm
elementType: 16 8 8 8 7 7 6 6 6 6 6 6 1 1 1 1 1 1 1 1 1 1 1 1 1 1
symmnumber: 1
zpe: 546971.3 jmol-1
zpe.correction: 0.208330 hartree
zpe.thermalcorrener: 0.222453 hartree
zpe.thermalcorrenthalpy: 0.223397 hartree
zpe.thermalcorrgfe: 0.167532 hartree
zpe.sumelectzpe: -969.069811 hartree
zpe.sumelectthermal: -969.055688 hartree
zpe.sumelectthermalent: -969.054744 hartree
zpe.sumelectthermalfe: -969.110609 hartree
dipole: -0.2295 -3.3832 2.4506
dipole: 4.1838
quadrupole: -79.9580 -81.5929 -82.6239
quadrupole: 9.8269 -2.2530 1.1938
quadrupole: 1.4336 -0.2013 -1.2323 9.8269 -2.2530 1.1938
hfenergy: -969.2781412 hartree
pointgroup: C01 [X(C6H14N2O3S1)]
dipole: -0.0996761 -1.4615253 0.7506494 debye
dipolederiv: 1.6584569 0.0902818 -0.1662778 0.1254021 1.1800054 -0.06912 -0.1749213 -0.0623439 1.1685915 -0.6236776 0.0167937 -0.0924565 0.0413363 -0.6436186 -0.1471858 -0.0999472 -0.1516039 -0.5179281 -0.7830291 0.0095652 -0.0133656 0.0239507 -0.5018295 0.0555721 -0.1981093 0.1678899 -0.7058399 -0.7164161 -0.0002491 0.0520794 -0.031036 -0.7548306 -0.0366931 0.0786156 -0.2030992 -0.527868 -0.219888 -0.0622008 0.0442291 -0.1656209 -0.423131 -0.0032837 0.1599509 -0.0275333 -0.4569861 -0.5409175 0.0470258 0.0401418 0.195873 -0.2207044 -0.0661887 0.035935 0.0005173 -0.449448 -0.2539724 0.0186067 -0.0906945 0.0869142 0.1307276 0.0192413 -0.3521546 0.0777067 0.2866685 -0.0964528 0.2092387 -0.0015484 0.4795302 0.1845882 -0.0384811 -0.1411352 -0.0504277 0.136399 0.607066 0.1262863 0.1131267 0.0794035 0.4850249 0.0435166 0.3463153 -0.0784797 0.3224671 0.4248902 -0.1393996 -0.0674158 -0.3917143 0.4528434 0.0598312 0.0617292 0.1395625 0.504048 0.0127047 -0.1102408 -0.0092099 -0.2030592 0.0519661 0.1058745 -0.214435 -0.0808049 0.2685042 0.3858661 0.0224983 -0.0425868 -0.2685754 0.0178163 0.0980433 0.1401458 0.1355592 0.0179129 0.0395217 0.0239235 0.0428375 0.0026031 -0.0113015 0.1139751 0.1023926 0.0111773 -0.0867502 0.0584483 -0.1157934 -0.0614578 -0.0713013 0.0079057 -0.0189861 -0.0063349 -0.0253208 0.0649778 0.1288086 0.0712481 0.0657896 -0.0271811 0.0346246 -0.059307 0.029459 -0.0512081 0.0239397 -0.0103633 -0.0534591 -0.0160797 -0.1106667 -0.0178467 0.0482221 0.054036 0.143552 -0.074998 -0.0393048 0.0668102 0.0529055 0.0431273 -0.0019719 -0.0870232 0.0347089 -0.1140524 -0.0217929 0.022172 -0.0997634 0.0019332 -0.0387237 -0.0552157 0.0505935 -0.0160206 0.1691408 -0.0894458 0.070043 0.017605 0.0998569 0.0331219 -0.0400923 0.1265582 0.0054254 0.0294378 -0.1459642 -0.098739 -0.0879924 -0.0513386 -0.0568177 -0.029656 -0.0619279 -0.0135572 -0.0413236 0.0711662 -0.0209767 0.0665104 0.1064247 0.1409057 0.0246656 -0.1072072 0.0703404 0.0157463 -0.0356124 -0.0344531 0.0163814 -0.1002426 0.0131317 0.1171831 -0.0595338 -0.0612978 -0.0117026 0.0717883 0.0842872 -0.0758801 0.043141 -0.0780608 -0.0769909 0.0467123 0.0697629 0.0627164 0.0338972 0.1427441 0.0017371 0.0489376 0.0918107 0.135505 0.0693355 -0.0154993 0.0238966 -0.0158179 -0.1577809 0.0250688 0.0159604 0.1519896 0.0394205 -0.072434 0.1103058 -0.0856086 0.0191166 -0.0390373 -0.0846022 -0.0146894 -0.0663429 -0.0850875 -0.010104 -0.0057104 0.0066057 0.1389746 unknown
polarizability: 145.8587958|4.9892636|109.6799632|1.3618009|2.7733247|103.5110553 unknown
InChI: InChI=1S/C6H14N2O3S/c1-7(2)12(9,10)8-3-5-11-6-4-8/h3-6H2,1-2H3
charge 0 multiplicity 1
26 atoms
S  -1.170863 0.715882 -0.241199
O  3.353723 -0.41867 -0.195318
O  -1.479956 0.986254 -1.818464
O  -1.389902 1.910975 0.846742
N  0.559864 0.043484 0.099331
N  -2.061125 -0.904261 0.180359
C  1.039777 -0.809287 -1.025123
C  1.519668 1.147829 0.40007
C  2.364927 -1.446945 -0.545385
C  2.823523 0.457795 0.858822
C  -2.095043 -1.076446 1.657072
C  -3.398341 -0.937732 -0.472562
H  1.213178 -0.22202 -1.950615
H  0.289186 -1.593608 -1.223036
H  1.104289 1.776885 1.205148
H  1.729049 1.77883 -0.489784
H  2.820681 -2.039693 -1.354968
H  2.16378 -2.097546 0.33156
H  2.630778 -0.127877 1.782171
H  3.608928 1.207453 1.047527
H  -2.773985 -0.365779 2.171926
H  -1.074449 -0.967671 2.056982
H  -2.440273 -2.108579 1.849934
H  -3.299775 -0.587149 -1.512871
H  -4.167372 -0.332739 0.051949
H  -3.718965 -1.995288 -0.486868
