program: Gaussian 09
title: 000223868
version: EM64L-G09RevD.01
frameworkgroup: C1[X(C24H27NO)]
method: RPBEPBE
basis: SDD
operation: Freq
keyword: #p
keyword: freq=noraman
keyword: PBEPBE/SDD
title: #p freq=noraman PBEPBE/SDD
converged: YES YES NO NO
title: Mulliken charges:
elementType: O N C C C C C C C C C C C C C C C C C C C C C C C C H H H H H H H H H H H H H H H H H H H H H H H H H H H
charge: -0.289956 -0.094215 0.357506 0.532014 -0.713274 0.189697 -0.624684 -0.715050 -0.400705 -0.354325 0.492231 -0.282219 0.497073 -0.381555 -0.380022 -0.431196 -0.376188 -0.451231 -0.614093 -0.614476 -0.225800 -0.225263 -0.228184 -0.223478 -0.247980 -0.250234 0.242352 0.208362 0.235394 0.225678 0.222479 0.242572 0.247653 0.205041 0.225360 0.197200 0.224769 0.256445 0.222276 0.245776 0.230855 0.227514 0.192661 0.220619 0.229359 0.191072 0.222775 0.219337 0.221543 0.224040 0.223404 0.224709 0.226362
chargesum: 0.00000
title: Mulliken charges with hydrogens summed into heavy atoms:
elementType: O N C C C C C C C C C C C C C C C C C C C C C C C C
charge: -0.289956 -0.094215 0.357506 0.532014 -0.262560 0.189697 -0.389290 -0.266893 -0.158133 -0.106672 0.492231 0.148182 0.497073 0.040414 -0.123578 -0.208921 -0.130412 -0.220376 0.026701 0.028731 -0.006463 -0.003719 -0.004144 -0.000074 -0.023272 -0.023872
polarizability: 3.10026956e+02 1.38356879e+01 2.64967999e+02 1.04792503e+01 2.59519310e+00 2.26802566e+02
1716.lowfreq: -4.2005 -0.0007 -0.0005 0.0006 3.6352 5.1804 13.4604 17.3334 20.7784
frequency: 13.3145 17.1205 20.7460 22.9063 26.4308 28.8756 48.4941 59.1777 69.8682 92.6284 125.6393 148.9995 162.9680 175.8020 181.1714 202.5386 215.4836 223.6435 240.1043 261.8051 298.1667 314.9000 345.1953 354.1502 371.5697 404.4261 404.8140 414.0023 436.3674 444.1219 460.9110 463.9328 515.6249 529.0390 538.3211 577.5400 602.8165 617.6729 618.3035 640.6787 703.7534 704.8569 712.9493 734.5714 742.8594 762.7111 782.2280 797.5449 811.4346 816.7051 827.9852 838.6718 853.9989 855.3816 890.2852 909.5856 915.3878 924.7140 943.9266 948.5419 966.7831 976.9393 977.4824 980.4663 989.7403 990.5142 993.0717 994.7493 1026.7267 1027.4884 1034.0680 1034.4006 1062.5946 1073.3707 1081.7681 1089.4500 1094.1803 1107.3547 1137.9059 1165.8120 1168.9335 1169.3880 1170.6537 1174.8241 1186.8702 1187.2693 1188.5057 1201.7041 1205.6912 1215.1429 1245.1474 1247.5441 1267.8176 1287.6367 1290.7814 1297.6395 1300.5638 1328.4762 1330.8034 1334.0278 1378.4105 1381.9780 1383.0354 1393.1832 1420.8845 1421.2534 1439.7093 1440.4042 1442.7039 1461.1686 1461.7521 1465.7718 1467.8991 1471.8609 1475.8963 1481.9500 1483.5314 1484.2948 1485.3237 1497.2977 1588.1735 1592.6149 1594.3438 1611.7420 1613.6375 1618.5626 2854.6021 2863.1409 2884.0726 2967.2279 2967.5117 3001.7928 3012.6575 3022.5684 3027.2538 3030.1303 3055.2832 3061.3401 3080.9243 3085.4243 3107.0722 3112.2137 3112.8048 3119.7941 3120.4994 3130.3800 3132.4176 3134.0940 3143.0084 3144.7873 3160.1193 3160.9028 3162.3624
redmass: 4.9629 4.0017 4.2418 4.0164 4.4269 2.5702 4.2161 4.2962 4.1969 3.0224 2.2689 5.0180 4.4039 3.4561 3.6206 3.7401 1.2414 1.6659 2.5046 2.4177 3.7072 2.5281 3.3376 2.8681 2.2344 2.8324 2.8142 2.6082 2.5942 3.4483 3.2827 3.2147 4.1457 4.2612 4.4393 4.6801 4.7299 6.3398 6.2981 4.1743 2.2583 1.8416 3.2702 2.3359 2.2009 2.9482 3.1963 1.9611 2.0752 2.3320 2.1567 2.0767 1.2484 1.2473 1.4688 1.5926 1.8947 1.7450 1.4412 1.9000 2.0916 1.3969 1.3908 7.6934 6.0821 6.0587 1.3202 1.3285 2.2032 2.2402 1.6623 2.0293 1.6206 1.7001 1.5877 1.4909 2.0386 2.2692 1.4385 1.4083 1.1461 1.4024 1.0580 1.1018 1.1153 1.1236 1.1390 2.8939 2.4590 2.2494 2.9138 1.8030 2.5319 1.6882 1.2324 1.5054 1.4385 1.2809 1.3602 1.3215 3.4298 7.2843 4.5140 1.9177 1.1874 3.0968 2.1014 2.2006 1.1615 1.0669 1.1414 1.1485 1.0709 1.1162 1.0555 2.0408 1.5705 1.5853 1.0565 1.9214 7.1617 6.0718 6.2990 6.1036 6.1223 6.3835 1.0567 1.0590 1.0676 1.0573 1.0588 1.0600 1.1002 1.0733 1.0800 1.0918 1.0973 1.1016 1.1008 1.1007 1.0910 1.0864 1.0867 1.0862 1.0863 1.0889 1.0914 1.0919 1.0961 1.0958 1.1015 1.1015 1.0941
irintensity: 0.0162 0.0058 0.0729 0.0296 0.1206 0.4112 0.8987 0.1536 0.2657 0.2638 5.0434 0.9303 0.3300 0.7053 1.9687 0.5324 1.4742 0.2668 1.0684 1.1853 1.1214 4.0695 5.8548 3.6046 1.5753 0.0668 0.2576 0.8611 2.0352 2.0743 3.9427 4.8103 4.1503 5.7437 28.0692 6.1858 11.1542 1.7729 0.6813 8.2144 26.6291 54.9762 19.7846 28.7913 26.4206 48.0974 9.8093 32.9755 3.3001 5.0345 4.9994 8.3549 0.1270 0.0650 5.2450 4.3714 0.7764 2.4874 1.7015 4.6814 6.9825 0.4050 0.0955 87.1659 0.1459 0.1298 1.0234 0.2131 11.5549 9.1146 36.4823 44.8380 5.4876 1.7420 16.4637 13.9633 5.9107 100.9084 2.5690 7.7569 6.3928 2.8204 0.2473 8.0743 1.4352 1.3748 2.0153 15.5605 52.0553 92.6132 57.1888 8.7538 17.5416 6.0104 2.3166 1.2224 1.9455 1.9339 3.5148 1.7633 4.8750 0.9161 4.6386 4.0029 5.0272 7.3580 6.6444 7.1060 4.5102 15.9490 18.0531 21.1696 5.6502 36.6032 11.1882 66.3670 57.8731 5.6746 8.5914 65.3835 1.9625 0.9601 0.5012 16.2565 7.4172 15.1564 66.1162 142.6555 137.6203 58.0836 13.2530 30.9529 12.5713 37.8609 48.6537 13.8172 37.4685 6.1926 29.3042 58.6478 14.2469 9.8666 8.6079 1.7395 0.3877 12.5997 14.3339 22.8630 45.4609 32.1708 28.9425 26.9319 12.9795
temp: 298.150 k
press: 1.00000 atm
elementType: 8 7 6 6 6 6 6 6 6 6 6 6 6 6 6 6 6 6 6 6 6 6 6 6 6 6 1 1 1 1 1 1 1 1 1 1 1 1 1 1 1 1 1 1 1 1 1 1 1 1 1 1 1
symmnumber: 1
zpe: 1166265.8 jmol-1
zpe.correction: 0.444207 hartree
zpe.thermalcorrener: 0.469145 hartree
zpe.thermalcorrenthalpy: 0.470089 hartree
zpe.thermalcorrgfe: 0.383874 hartree
zpe.sumelectzpe: -1058.819370 hartree
zpe.sumelectthermal: -1058.794432 hartree
zpe.sumelectthermalent: -1058.793488 hartree
zpe.sumelectthermalfe: -1058.879704 hartree
dipole: 1.3517 -1.2197 0.4819
dipole: 1.8834
quadrupole: -141.3770 -150.5654 -146.9621
quadrupole: -4.8257 5.7547 -2.0998
quadrupole: 4.9245 -4.2639 -0.6606 -4.8257 5.7547 -2.0998
hfenergy: -1059.2635773 hartree
pointgroup: C01 [X(C24H27N1O1)]
dipole: -0.6019144 -0.3252016 -0.284613 debye
polarizability: 304.1299031|-22.3583755|270.1361821|5.1918079|6.6067007|227.531435 unknown
InChI: InChI=1S/C24H27NO/c1-25(2)15-16-26-24-14-13-22(17-20-9-5-3-6-10-20)19-23(24)18-21-11-7-4-8-12-21/h3-14,19H,15-18H2,1-2H3
charge 0 multiplicity 1
53 atoms
O  -2.43636 -0.463206 0.634145
N  -5.567298 -1.871997 -0.832557
C  -0.331897 0.272117 1.529442
C  1.762926 -0.983298 1.07999
C  -1.044047 1.458448 2.178651
C  -1.047972 -0.683265 0.754358
C  1.062669 0.096278 1.672122
C  3.264866 -1.157239 1.304377
C  1.020424 -1.914773 0.315781
C  -0.373658 -1.773459 0.152586
C  -1.000971 2.73235 1.330035
C  -3.229086 -1.453378 -0.113694
C  4.078158 -1.492095 0.054714
C  -4.689319 -0.985355 -0.034675
C  -1.753522 2.827823 0.129557
C  -0.207109 3.839596 1.721697
C  3.960226 -0.707443 -1.122579
C  4.992358 -2.575109 0.055917
C  -5.533742 -1.573261 -2.279761
C  -6.950827 -1.930706 -0.318317
C  -1.709329 3.999299 -0.657513
C  -0.159608 5.014262 0.934685
C  4.740687 -0.994552 -2.263393
C  5.77563 -2.867646 -1.085103
C  -0.910996 5.098123 -0.259197
C  5.653525 -2.076457 -2.249458
H  -2.096399 1.179694 2.365366
H  -0.57342 1.663333 3.158122
H  1.619276 0.833887 2.265837
H  3.660397 -0.225391 1.756357
H  3.433875 -1.954387 2.056362
H  1.536149 -2.754844 -0.163591
H  -0.920211 -2.511925 -0.441069
H  -2.874113 -1.500274 -1.163056
H  -3.126336 -2.457177 0.342014
H  -4.749755 0.084148 -0.355346
H  -5.00802 -1.023613 1.022305
H  -2.370731 1.975682 -0.177292
H  0.374629 3.783757 2.650774
H  3.246888 0.125277 -1.141629
H  5.091895 -3.194109 0.956755
H  -6.108497 -2.339881 -2.82926
H  -5.9656 -0.570243 -2.528056
H  -4.496831 -1.598869 -2.656525
H  -6.944219 -2.244914 0.740085
H  -7.495146 -0.955069 -0.389476
H  -7.525488 -2.680384 -0.891733
H  -2.29787 4.058313 -1.580759
H  0.459037 5.860942 1.254358
H  4.638585 -0.376426 -3.162882
H  6.47651 -3.71018 -1.06485
H  -0.87745 6.007503 -0.870019
H  6.258818 -2.299907 -3.135305
