program: Gaussian 09
title: 000223604
version: EM64L-G09RevD.01
frameworkgroup: C1[X(C18H18O4)]
method: RPBEPBE
basis: SDD
operation: Freq
keyword: #pfreq=noraman
keyword: PBEPBE/SDD
title: #p freq=noraman PBEPBE/SDD
converged: YES YES NO NO
title: Mulliken charges:
elementType: O O O O C C C C C C C C C C C C C C C C C C H H H H H H H H H H H H H H H H H H
charge: -0.438454 -0.436369 -0.182654 -0.201478 0.165770 -0.424216 -0.594469 -0.612545 0.473776 0.115123 0.133043 0.513182 -0.393715 -0.404248 -0.428490 -0.400006 -0.228767 -0.231222 -0.225728 -0.233514 -0.237315 -0.243036 0.240074 0.251843 0.226912 0.251091 0.244080 0.232188 0.251920 0.230751 0.233577 0.237058 0.382926 0.382816 0.223127 0.223477 0.223914 0.223635 0.228191 0.227754
chargesum: 0.00000
title: Mulliken charges with hydrogens summed into heavy atoms:
elementType: O O O O C C C C C C C C C C C C C C C C C C
charge: -0.055528 -0.053553 -0.182654 -0.201478 0.165770 0.067700 -0.116466 -0.136278 0.473776 0.115123 0.133043 0.513182 -0.141795 -0.173498 -0.194913 -0.162947 -0.005640 -0.007745 -0.001814 -0.009879 -0.009124 -0.015282
polarizability: 2.63823902e+02 2.19235486e+00 1.99337617e+02 2.24807635e+01 -2.95553277e+00 1.28344080e+02
1716.lowfreq: -8.5008 -4.6812 -0.0010 -0.0005 -0.0003 1.4520 11.3880 19.7285 26.5418
frequency: 10.0174 19.5342 25.8331 34.5452 42.2420 68.0176 71.0509 91.0051 100.6806 128.3118 160.9134 193.6511 201.3106 215.2919 270.4224 306.5798 320.4751 345.1211 362.4109 378.8613 403.4528 405.2200 429.8525 474.0202 499.3803 552.6005 565.6242 575.0800 582.6756 608.1610 617.3854 619.1930 633.3611 673.6515 704.0775 704.9894 713.4749 735.3119 760.9079 766.1660 773.6537 813.2973 825.4137 839.8743 854.0496 856.4755 917.5813 926.7974 945.9520 975.3074 978.6719 986.7249 989.8475 991.4084 993.4246 995.3280 997.6173 1026.3591 1029.4649 1048.0052 1062.1133 1063.2621 1070.6591 1082.8560 1114.1806 1171.1593 1172.1647 1174.9907 1186.4311 1188.7221 1215.8543 1218.0898 1236.8211 1267.9492 1276.9572 1282.8314 1318.4374 1321.3763 1332.1974 1342.4106 1362.2868 1383.1827 1385.3665 1441.1797 1443.3277 1454.7006 1472.2785 1480.9896 1484.4032 1484.6248 1593.5049 1593.6226 1613.9387 1615.6254 1647.9835 1686.4329 2996.9757 3006.2256 3016.8176 3053.0475 3077.4693 3082.1202 3113.6949 3114.0720 3115.8870 3125.6989 3131.5413 3138.5840 3143.0082 3150.8703 3161.9401 3164.3941 3510.7492 3517.1397
redmass: 4.2297 4.1063 4.6962 5.9969 6.3471 9.1205 5.4196 5.6133 4.2621 7.2044 5.9801 4.1226 6.3529 5.2925 2.5353 3.9399 6.8137 2.7273 2.9769 3.6778 2.8218 2.8294 4.2600 4.3715 3.3240 2.8638 3.3894 4.0354 2.8007 1.6161 6.3349 5.6835 1.5607 3.6252 2.3462 1.8820 2.4509 2.8206 2.2577 1.5069 2.2874 4.2009 3.3397 2.2389 1.2653 1.2469 1.4609 1.4620 2.2470 1.3920 1.4161 3.8438 5.7717 5.0301 1.3855 1.4129 2.2997 2.2054 2.1808 2.8140 4.4582 2.0416 4.7529 1.5670 1.4475 1.0716 1.0539 1.0892 1.1148 1.1153 2.7370 2.6371 1.3649 1.5681 1.4446 1.4406 1.4792 1.4467 1.2896 1.5508 1.4405 7.0540 5.9970 2.1547 2.1552 1.0928 1.1451 1.3592 1.6549 2.1361 6.0481 6.0275 6.1587 6.1230 9.5322 9.3971 1.0606 1.0600 1.0601 1.0998 1.1038 1.1024 1.0872 1.0869 1.0871 1.0863 1.0908 1.0920 1.0958 1.0954 1.1014 1.1012 1.0639 1.0640
irintensity: 0.0151 0.0503 0.1758 0.0964 0.6776 0.9160 0.1853 0.1494 0.1034 0.5548 0.9634 0.0590 0.3990 0.1307 0.5074 1.4620 1.4893 1.1535 2.8333 1.8315 0.0041 0.0769 3.9809 0.5256 16.8834 18.5574 53.2309 18.4813 44.1846 70.0248 0.1903 3.2792 219.1908 4.3307 51.7478 37.9944 4.6600 54.3754 31.6183 9.7470 12.2160 2.1555 5.8809 5.4206 0.2027 1.3929 1.2412 3.5599 107.0905 1.1738 6.8347 29.9050 7.7856 7.1421 31.7175 11.8032 127.3227 5.2088 7.8396 26.7921 26.1597 38.5300 21.4895 10.5605 49.6294 0.2575 0.1972 0.4750 0.2004 1.2010 1.5997 0.0871 2.0109 3.5129 6.6102 5.0816 20.1631 3.9323 0.9889 16.0415 0.7742 0.2018 1.2411 6.3416 5.2927 0.8207 7.8911 25.6196 18.2905 9.0139 0.5773 2.5926 14.3548 3.9066 81.0654 297.5390 0.7166 25.7434 22.2737 1.5938 7.5017 12.7281 10.2683 8.3600 6.8308 0.2358 10.4088 22.6757 42.8462 30.7704 27.6554 21.1249 34.0304 29.6002
temp: 298.150 k
press: 1.00000 atm
elementType: 8 8 8 8 6 6 6 6 6 6 6 6 6 6 6 6 6 6 6 6 6 6 1 1 1 1 1 1 1 1 1 1 1 1 1 1 1 1 1 1
symmnumber: 1
zpe: 831400.2 jmol-1
zpe.correction: 0.316664 hartree
zpe.thermalcorrener: 0.337093 hartree
zpe.thermalcorrenthalpy: 0.338037 hartree
zpe.thermalcorrgfe: 0.263251 hartree
zpe.sumelectzpe: -996.035296 hartree
zpe.sumelectthermal: -996.014867 hartree
zpe.sumelectthermalent: -996.013923 hartree
zpe.sumelectthermalfe: -996.088709 hartree
dipole: -0.5357 -0.5551 -2.5960
dipole: 2.7082
quadrupole: -120.9089 -107.1546 -143.1279
quadrupole: -0.2381 0.4483 -6.5256
quadrupole: 2.8216 16.5758 -19.3974 -0.2381 0.4483 -6.5256
hfenergy: -996.3519597 hartree
pointgroup: C01 [X(C18H18O4)]
dipole: -0.2093277 -0.1064863 -1.0392995 debye
polarizability: 263.7375598|-0.517361|199.1526783|22.8532681|4.5995924|128.6153609 unknown
InChI: InChI=1S/C18H18O4/c19-16(20)18(17(21)22,13-15-9-5-2-6-10-15)12-11-14-7-3-1-4-8-14/h1-10,19,21H,11-13H2
charge 0 multiplicity 1
40 atoms
O  0.265175 -2.174899 0.667219
O  0.909305 2.566813 -0.026038
O  1.557046 -0.906484 2.112314
O  0.369757 1.76633 2.074846
C  0.451779 0.182814 0.152949
C  -1.046011 0.094665 -0.323425
C  1.370021 0.046529 -1.128773
C  -2.112741 0.106174 0.803898
C  2.869066 -0.065789 -0.881465
C  0.816438 -0.955817 1.11545
C  0.601719 1.529461 0.873857
C  -3.515928 -0.002686 0.22158
C  3.691783 1.087546 -0.802842
C  3.477594 -1.341568 -0.753383
C  -4.333318 1.145875 0.067418
C  -4.020444 -1.25569 -0.215463
C  5.082939 0.968386 -0.588465
C  4.867913 -1.464599 -0.538556
C  -5.620461 1.048576 -0.50959
C  -5.306191 -1.358619 -0.791186
C  5.676075 -0.307962 -0.452702
C  -6.110949 -0.204813 -0.942277
H  -1.228919 0.935628 -1.019866
H  -1.150796 -0.840946 -0.90095
H  1.014594 -0.855446 -1.659624
H  1.149269 0.921892 -1.763352
H  -2.021624 1.026853 1.407668
H  -1.919255 -0.745273 1.483366
H  3.234453 2.076503 -0.914061
H  2.857294 -2.243576 -0.833357
H  -3.961037 2.120073 0.408601
H  -3.403029 -2.155058 -0.094222
H  0.577885 -2.89978 1.273773
H  0.905659 3.426504 0.476603
H  5.704532 1.869274 -0.531946
H  5.320458 -2.458059 -0.442372
H  -6.240504 1.945989 -0.616922
H  -5.682609 -2.334905 -1.117666
H  6.755396 -0.400351 -0.287525
H  -7.109637 -0.28307 -1.386514
