program: Gaussian 09
title: 000223605
version: EM64L-G09RevD.01
frameworkgroup: C1[X(C19H17NO2S)]
method: RPBEPBE
basis: SDD
operation: Freq
keyword: #p
keyword: freq=noraman
keyword: PBEPBE/SDD
title: #p freq=noraman PBEPBE/SDD
converged: YES YES NO NO
title: Mulliken charges:
elementType: S O O N C C C C C C C C C C C C C C C C C C C H H H H H H H H H H H H H H H H H
charge: 0.891479 -0.512417 -0.541618 -0.386991 -0.631839 0.338620 0.016176 0.459146 -0.360144 -0.250985 -0.255824 -0.262200 -0.381992 -0.364900 -0.210458 -0.235045 -0.205885 -0.204255 -0.231521 -0.232038 -0.235626 -0.219481 -0.237635 0.250405 0.290649 0.259992 0.284520 0.280238 0.291481 0.234696 0.267672 0.230312 0.233226 0.240510 0.241149 0.225468 0.229487 0.231022 0.236736 0.227870
chargesum: 0.00000
title: Mulliken charges with hydrogens summed into heavy atoms:
elementType: S O O N C C C C C C C C C C C C C C C C C C C
charge: 0.891479 -0.512417 -0.541618 -0.386991 -0.090785 0.338620 0.016176 0.459146 -0.100152 0.033535 0.024415 0.029281 -0.147296 -0.097228 0.019854 -0.001818 0.034625 0.036894 -0.006054 -0.002551 -0.004604 0.017255 -0.009765
polarizability: 2.92479194e+02 5.15729082e-01 2.37903445e+02 2.77203708e+01 4.09765493e+00 1.83213568e+02
1716.lowfreq: -10.9576 -7.0482 -0.0009 -0.0009 0.0008 1.0649 17.1632 25.4601 30.7547
frequency: 16.7638 25.3224 30.7183 34.5503 43.1384 64.4994 75.6555 82.0304 136.8676 158.7606 178.4040 186.5523 197.7943 223.6173 243.8812 249.6810 334.8470 347.0375 363.4379 382.1931 403.3043 403.7898 412.1713 421.2594 457.2614 489.1181 506.5203 536.4457 542.1788 602.7369 608.6345 616.6672 635.1192 661.1149 688.2974 700.8844 708.1903 729.3129 760.1763 770.9509 779.9582 795.4362 817.9848 849.9231 851.0113 862.1366 917.5110 925.9314 931.8388 934.3289 957.2571 972.0057 978.6677 982.7617 983.6358 985.4160 989.0622 989.8321 1000.5980 1003.3212 1004.1138 1008.9540 1023.5872 1027.9928 1049.9933 1076.9868 1077.1549 1088.2665 1168.0983 1172.8280 1173.2087 1178.3197 1179.4792 1191.6678 1198.0674 1213.1600 1242.5616 1304.2581 1305.3355 1331.5873 1342.9015 1373.1554 1383.7808 1384.0549 1431.8202 1436.3192 1439.2544 1442.9545 1454.0700 1467.1600 1484.1513 1578.2262 1579.0300 1592.5434 1595.7132 1604.6976 1612.4238 2994.2104 3055.4830 3116.5866 3124.4315 3127.9196 3133.9853 3136.5711 3139.9559 3146.7061 3148.4892 3154.4195 3157.8681 3162.8948 3166.9715 3167.0290 3175.2939 3185.8992
redmass: 5.5576 4.6428 4.3458 4.6251 4.8920 4.6006 5.3439 5.9193 5.9818 6.2078 4.9045 6.1838 6.5962 10.1859 4.5565 8.8961 6.0568 2.7179 3.6680 6.4692 2.8716 2.8303 3.5035 5.0423 4.3733 4.5043 5.6760 4.9956 4.0117 6.4775 6.1106 6.2768 4.5383 6.8626 2.3826 1.8048 1.8563 2.9714 1.4343 2.6908 1.9541 14.1003 3.2254 1.2446 1.2414 1.2486 9.8473 1.6124 1.4993 1.4053 1.9114 4.4801 5.8327 1.4042 1.4009 1.3860 5.6726 5.9535 1.3569 1.3331 1.3353 4.0739 2.0545 2.1982 2.1587 1.5563 1.5501 1.5693 1.0940 1.0560 1.0573 1.1234 1.2440 1.2649 1.8521 2.9206 1.3049 1.2984 1.3727 1.2555 1.2326 7.4373 7.1270 8.1740 2.2216 2.2057 1.2781 1.7596 2.0338 2.1619 2.1945 5.8311 5.9181 5.9843 6.1095 6.9443 5.9292 1.0602 1.1018 1.0866 1.0872 1.0851 1.0920 1.0858 1.0896 1.0961 1.0887 1.0944 1.0929 1.1015 1.0986 1.0971 1.1014 1.0961
irintensity: 1.0807 0.5163 0.2168 0.1691 1.0763 0.0407 0.5261 2.0594 0.9418 0.9867 4.6599 2.4721 4.1808 5.9025 1.2296 9.1015 1.6952 0.1983 23.8480 13.3604 0.8972 0.0298 4.0239 11.8142 44.9273 12.9475 114.1183 37.0827 2.9830 0.0119 2.2184 0.2757 20.1938 11.5154 31.7414 43.8566 59.7133 33.2209 69.4935 16.9595 28.1638 63.4046 25.6590 0.1471 1.0837 0.1860 56.6529 3.9364 10.4444 5.6689 9.4989 26.5397 2.0197 0.1679 1.1431 0.5381 2.6813 0.1800 1.0133 0.6290 0.1721 2.1423 12.2253 3.5277 21.9876 7.9488 3.8994 15.9757 0.4723 0.1543 0.2823 9.6480 0.2511 2.1562 1.4649 18.1919 31.2351 3.0063 1.4758 2.4252 2.0834 1.7438 0.7639 5.4708 10.0089 20.2660 24.2601 9.5381 15.8027 23.8216 13.6671 5.2579 1.3961 1.4056 0.6412 0.5553 2.5426 12.5158 2.6467 5.2734 0.3390 0.1424 11.2301 1.0582 10.6935 27.6768 11.6397 26.3181 3.1512 31.0359 13.7348 8.4547 28.3424 1.3868
temp: 298.150 k
press: 1.00000 atm
elementType: 16 8 8 7 6 6 6 6 6 6 6 6 6 6 6 6 6 6 6 6 6 6 6 1 1 1 1 1 1 1 1 1 1 1 1 1 1 1 1 1
symmnumber: 1
zpe: 807784.9 jmol-1
zpe.correction: 0.307669 hartree
zpe.thermalcorrener: 0.328411 hartree
zpe.thermalcorrenthalpy: 0.329356 hartree
zpe.thermalcorrgfe: 0.255020 hartree
zpe.sumelectzpe: -1335.683322 hartree
zpe.sumelectthermal: -1335.662580 hartree
zpe.sumelectthermalent: -1335.661635 hartree
zpe.sumelectthermalfe: -1335.735971 hartree
dipole: -2.2373 4.1599 -1.8560
dipole: 5.0750
quadrupole: -113.6137 -141.5341 -140.1299
quadrupole: -0.4856 6.2224 3.9911
quadrupole: 18.1455 -9.7748 -8.3707 -0.4856 6.2224 3.9911
hfenergy: -1335.9909911 hartree
pointgroup: C01 [X(C19H17N1O2S1)]
dipole: 0.7326885 -1.175764 -1.4378414 debye
polarizability: 291.9801812|9.3369052|227.8992744|-27.0607903|21.5020635|193.7167527 unknown
InChI: InChI=1S/C19H17NO2S/c21-23(22,19-14-8-3-9-15-19)20(18-12-6-2-7-13-18)16-17-10-4-1-5-11-17/h1-15H,16H2
charge 0 multiplicity 1
40 atoms
S  0.852627 1.052907 0.858007
O  0.415141 0.054775 2.077019
O  0.752881 2.674414 1.043819
N  -0.065482 0.695013 -0.836083
C  -1.191106 1.679725 -1.012636
C  -0.309467 -0.7185 -1.012829
C  2.618358 0.603801 0.374945
C  -2.509127 1.422636 -0.292889
C  0.389793 -1.344945 -2.078858
C  -1.167399 -1.490117 -0.180261
C  3.371248 1.551783 -0.336538
C  3.108254 -0.645361 0.785369
C  -3.58596 0.786516 -0.960729
C  -2.681999 1.833471 1.054908
C  0.203163 -2.719212 -2.34073
C  -1.335146 -2.867552 -0.439861
C  4.704108 1.212546 -0.664189
C  4.443515 -0.966223 0.444485
C  -4.810832 0.552959 -0.295374
C  -3.904096 1.598265 1.72283
C  -0.660667 -3.483217 -1.520427
C  5.234235 -0.04261 -0.278502
C  -4.971529 0.956704 1.050465
H  -1.347512 1.700053 -2.108405
H  -0.770508 2.657593 -0.714203
H  1.062598 -0.733677 -2.689041
H  -1.676952 -1.021799 0.665345
H  2.938436 2.520852 -0.603725
H  2.474182 -1.32583 1.362663
H  -3.462654 0.469503 -2.003926
H  -1.858923 2.338666 1.574938
H  0.734823 -3.193138 -3.173224
H  -1.991579 -3.461168 0.205827
H  5.325179 1.927218 -1.214174
H  4.861484 -1.931979 0.746774
H  -5.635072 0.060508 -0.823714
H  -4.025112 1.918515 2.763668
H  -0.800411 -4.552205 -1.717102
H  6.268357 -0.296873 -0.53541
H  -5.920247 0.777685 1.56917
