program: Gaussian 09
title: 000223601
version: EM64L-G09RevD.01
frameworkgroup: C1[X(C16H15NO2)]
method: RPBEPBE
basis: SDD
operation: Freq
keyword: #p
keyword: freq=noraman
keyword: PBEPBE/SDD
title: #p freq=noraman PBEPBE/SDD
converged: YES YES NO NO
title: Mulliken charges:
elementType: O O N C C C C C C C C C C C C C C C C H H H H H H H H H H H H H H H
charge: -0.244868 -0.211051 -0.202937 0.449488 0.328283 0.087996 -0.050509 0.439194 -0.314228 -0.353381 -0.388429 -0.379258 -0.661939 -0.319758 -0.358976 -0.803469 -0.227176 -0.230599 -0.245861 0.262167 0.273791 0.236130 0.236357 0.229179 0.252173 0.283200 0.285776 0.240536 0.228892 0.229199 0.243720 0.229295 0.226298 0.230762
chargesum: 0.00000
title: Mulliken charges with hydrogens summed into heavy atoms:
elementType: O O N C C C C C C C C C C C C C C C C
charge: -0.244868 -0.211051 -0.202937 0.449488 0.328283 0.087996 -0.050509 0.439194 -0.052061 -0.079590 -0.152299 -0.142901 0.102614 -0.033982 -0.118439 -0.101658 0.002118 -0.004301 -0.015099
polarizability: 3.03557531e+02 7.74958852e+00 1.57047522e+02 3.18483712e-01 1.14769687e+00 1.35436687e+02
1716.lowfreq: -7.5110 -0.0007 -0.0005 0.0004 3.8568 9.1249 20.7716 33.0871 37.3302
frequency: 20.6353 33.0623 37.3092 38.8086 46.3229 101.7270 117.2291 136.3478 176.4397 194.1039 205.3669 251.1366 266.1766 300.1237 325.8848 343.3432 367.2109 394.1648 402.0118 407.7425 433.7183 479.2838 523.1268 530.7891 605.7732 614.0694 632.7768 645.7978 691.7984 702.6102 715.6201 739.6641 766.6785 779.1701 802.9644 832.0604 846.3504 858.7735 908.4984 933.7301 967.5029 973.9969 986.4970 989.4664 990.8717 995.3409 1011.7021 1029.8300 1046.1132 1082.0190 1101.9342 1112.9465 1120.6875 1126.7343 1175.4640 1194.3717 1199.3618 1222.6052 1226.3131 1263.3173 1312.2195 1325.5784 1354.6263 1372.5827 1384.6499 1397.3732 1413.7380 1439.0918 1444.2379 1468.0170 1472.1593 1482.5449 1487.9688 1492.0323 1501.5854 1536.9661 1549.5436 1578.2537 1592.0511 1611.9103 1618.8399 2976.9955 2989.0341 3059.0073 3082.9210 3090.0364 3128.1443 3129.4996 3131.2114 3140.5665 3153.2471 3157.1283 3157.9851 3167.6453 3169.5619 3206.3861
redmass: 5.0826 4.4895 1.7936 1.4707 3.9599 4.6448 5.0814 4.5460 4.8107 1.2307 4.0497 5.2218 4.9532 5.5024 4.8806 3.3749 5.4959 3.7711 2.9080 3.0143 5.1992 2.9795 3.5778 4.4333 5.8463 6.2989 6.8437 5.8426 1.9645 4.0840 6.2463 3.6708 1.9659 3.4537 4.6762 1.2566 1.6338 1.3662 1.4393 4.6844 1.3736 1.3568 5.0138 1.4211 1.3653 1.3704 2.8372 2.3529 1.5976 2.0854 1.9406 2.0563 1.4549 1.3052 1.0534 1.1628 1.1382 4.0589 2.9088 4.0413 1.2943 1.4958 3.2922 4.5677 8.6868 1.2203 3.7385 1.4328 1.8171 1.1105 1.0581 1.3448 1.4530 1.1487 2.5984 7.0409 8.3218 6.5822 6.4731 6.0566 6.2783 1.0391 1.0424 1.0942 1.0965 1.1001 1.0888 1.0851 1.0896 1.0900 1.0968 1.0954 1.0943 1.0953 1.0989 1.0946
irintensity: 1.3765 1.4188 0.5271 1.0596 2.6728 0.2022 0.3710 2.4719 5.0434 0.2295 1.1986 13.9632 4.2653 10.3587 3.4579 7.9787 4.2087 4.7718 0.2880 0.1621 1.2024 15.2793 8.3796 16.1281 36.0681 1.0316 0.7892 13.1051 45.5203 14.5810 3.9107 36.2879 59.6483 15.4754 1.0247 0.8891 14.9066 10.7002 3.6357 171.0423 0.3752 0.4033 0.0340 5.7642 0.2519 1.1281 1.0257 20.7768 28.4836 17.5150 40.2636 106.0299 0.3622 9.8656 1.2862 59.5714 1.3758 26.2999 0.1165 250.6339 1.5452 20.7805 61.8879 10.1044 1.1158 15.2257 5.5248 4.6225 15.0764 15.1213 14.1451 73.8351 20.5935 70.2690 5.5453 144.4787 389.8976 34.7385 19.2347 20.1323 80.5314 23.4826 40.9922 20.3299 20.1085 15.4370 15.0038 1.3142 15.1216 13.6793 5.2729 11.2616 32.8855 3.1780 17.4337 0.7539
temp: 298.150 k
press: 1.00000 atm
elementType: 8 8 7 6 6 6 6 6 6 6 6 6 6 6 6 6 6 6 6 1 1 1 1 1 1 1 1 1 1 1 1 1 1 1
symmnumber: 1
zpe: 703409.1 jmol-1
zpe.correction: 0.267914 hartree
zpe.thermalcorrener: 0.285468 hartree
zpe.thermalcorrenthalpy: 0.286412 hartree
zpe.thermalcorrgfe: 0.219806 hartree
zpe.sumelectzpe: -822.560148 hartree
zpe.sumelectthermal: -822.542595 hartree
zpe.sumelectthermalent: -822.541651 hartree
zpe.sumelectthermalfe: -822.608256 hartree
dipole: 1.1854 -1.3157 3.7787
dipole: 4.1731
quadrupole: -82.4711 -113.7699 -109.9925
quadrupole: -2.8378 -0.7134 2.7327
quadrupole: 19.6067 -11.6920 -7.9147 -2.8378 -0.7134 2.7327
hfenergy: -822.8280625 hartree
pointgroup: C01 [X(C16H15N1O2)]
dipole: 0.4681063 -1.3487963 0.8107031 debye
polarizability: 303.8810766|3.5498966|147.1269224|0.7112779|10.6325701|145.033741 unknown
InChI: InChI=1S/C16H15NO2/c1-12-8-10-13(11-9-12)15(18)16(19)17(2)14-6-4-3-5-7-14/h3-11H,1-2H3
charge 0 multiplicity 1
34 atoms
O  -0.492343 0.492275 -1.383593
O  0.935087 2.250215 1.054193
N  -1.44233 0.321274 0.77536
C  -2.752549 -0.088733 0.322413
C  2.172755 0.393435 0.110615
C  -0.407315 0.595162 -0.117912
C  0.928278 1.140465 0.435252
C  4.617367 -1.003839 -0.382268
C  2.165278 -0.852587 -0.57545
C  3.415852 0.932292 0.546253
C  3.37268 -1.537687 -0.810632
C  4.615831 0.242622 0.303454
C  -1.196047 0.313982 2.2393
C  -3.289499 0.375815 -0.909513
C  -3.538574 -0.94316 1.141664
C  5.916542 -1.729126 -0.675258
C  -4.584668 -0.018595 -1.303883
C  -4.833958 -1.328735 0.735278
C  -5.36573 -0.871603 -0.490663
H  1.221615 -1.268623 -0.940952
H  3.408695 1.890941 1.076015
H  3.355712 -2.496455 -1.342229
H  5.566916 0.667695 0.645691
H  -1.003284 -0.710094 2.610837
H  -2.077593 0.723689 2.758626
H  -0.335866 0.951444 2.477339
H  -2.698356 1.029589 -1.551072
H  -3.145869 -1.320523 2.090431
H  6.681243 -1.521543 0.093423
H  5.768972 -2.821617 -0.731631
H  6.33386 -1.403934 -1.64848
H  -4.985395 0.350152 -2.254565
H  -5.423786 -1.989949 1.379778
H  -6.370823 -1.171745 -0.805524
