program: Gaussian 09
title: 000018986
version: EM64L-G09RevD.01
frameworkgroup: C1[X(C11H11NO3)]
method: RPBEPBE
basis: SDD
operation: Freq
keyword: #p
keyword: freq=noraman
keyword: PBEPBE/SDD
title: #p freq=noraman PBEPBE/SDD
converged: YES YES NO NO
title: Mulliken charges:
elementType: O O O N C C C C C C C C C C C H H H H H H H H H H H
charge: -0.271562 -0.420316 -0.226136 -0.402950 0.148844 0.334719 0.215300 -0.394962 -0.615250 -0.551652 -0.318363 0.314115 -0.343250 0.208988 -0.537118 0.269869 0.306671 0.242192 0.235221 0.273189 0.229202 0.247971 0.240702 0.219333 0.219263 0.375981
chargesum: 0.00000
title: Mulliken charges with hydrogens summed into heavy atoms:
elementType: O O O N C C C C C C C C C C C
charge: -0.271562 -0.044335 -0.226136 -0.096279 0.148844 0.334719 0.215300 -0.125093 -0.137838 -0.278463 -0.089161 0.314115 -0.095279 0.208988 0.142181
polarizability: 1.74437437e+02 1.62862515e+01 1.55567708e+02 8.82463582e+00 -5.70273620e+00 7.67029793e+01
1716.lowfreq: -8.1167 -4.1864 -2.6812 -0.0006 -0.0005 -0.0004 27.4220 46.6869 66.3946
frequency: 27.1943 46.6375 66.3881 92.4602 142.4460 151.4013 176.3918 237.4419 245.3977 309.9372 377.6841 381.6180 403.7277 429.0643 467.9730 483.1773 497.2466 517.8608 553.9431 591.8532 604.6233 643.7574 657.8550 724.1904 749.7911 770.6771 791.1992 805.0553 818.7355 840.9524 858.2395 904.9965 925.3088 935.6131 995.0390 1034.8795 1064.2560 1098.2406 1113.3151 1134.6470 1154.8330 1176.9570 1198.6923 1240.5178 1255.2245 1278.8213 1302.7045 1315.6185 1324.0792 1394.0722 1423.4037 1437.1933 1451.6339 1463.3401 1464.3895 1477.4680 1482.2181 1556.7858 1595.7846 1634.9114 1670.5512 2952.9227 3019.3104 3036.9773 3090.5863 3119.8558 3137.1216 3168.3417 3171.3073 3224.9706 3507.2447 3615.0487
redmass: 7.0080 7.8254 4.5394 3.9186 3.6727 3.9298 4.4956 1.5707 2.1507 4.8468 4.8642 5.7427 2.5881 2.8822 3.7550 4.3791 1.2705 3.4923 4.0403 2.3634 2.2484 3.7263 2.2007 5.1990 4.0743 3.2530 1.8851 1.5613 4.4513 2.9174 2.0975 4.3544 2.2163 1.3310 4.5825 2.4112 2.5740 1.4771 1.2632 1.2353 1.3732 1.4242 2.4549 2.0639 1.5592 1.8448 2.3958 2.0152 1.8509 5.2712 1.8654 1.5551 1.1114 1.0579 2.4209 1.3040 3.3663 6.0186 6.4176 7.1038 8.4869 1.0332 1.0599 1.1035 1.1024 1.0990 1.0893 1.0917 1.0953 1.0987 1.0638 1.0810
irintensity: 1.1929 1.2241 1.0547 9.4860 1.1123 0.1365 2.8584 1.9816 3.4389 2.4700 3.3766 4.6322 3.2924 5.0520 10.6475 8.2731 96.0596 11.6340 31.7742 30.2263 39.8982 12.7569 119.5379 6.2131 0.6084 10.5458 41.5013 23.7158 11.1206 29.5338 30.4502 10.1780 30.7156 0.0998 39.1143 45.8388 139.3979 42.3314 0.1861 1.5993 0.5347 7.3416 149.1285 19.4711 14.7798 3.9013 36.5512 19.2004 25.2487 13.0439 31.6299 11.0370 22.5675 15.1715 69.2690 0.7165 83.1243 3.4165 25.3685 34.9784 261.8475 58.3490 21.2694 53.0404 5.7646 30.4284 11.3155 4.3967 8.6259 0.1701 16.7975 67.8154
temp: 298.150 k
press: 1.00000 atm
elementType: 8 8 8 7 6 6 6 6 6 6 6 6 6 6 6 1 1 1 1 1 1 1 1 1 1 1
symmnumber: 1
zpe: 526441.2 jmol-1
zpe.correction: 0.200511 hartree
zpe.thermalcorrener: 0.214021 hartree
zpe.thermalcorrenthalpy: 0.214965 hartree
zpe.thermalcorrgfe: 0.159113 hartree
zpe.sumelectzpe: -705.112478 hartree
zpe.sumelectthermal: -705.098968 hartree
zpe.sumelectthermalent: -705.098024 hartree
zpe.sumelectthermalfe: -705.153875 hartree
dipole: 0.0425 0.7297 0.8987
dipole: 1.1584
quadrupole: -97.8352 -61.0114 -89.7536
quadrupole: 4.0570 5.7470 -1.3589
quadrupole: -14.9685 21.8554 -6.8869 4.0570 5.7470 -1.3589
hfenergy: -705.3129886 hartree
pointgroup: C01 [X(C11H11N1O3)]
dipole: 0.0311525 -0.2820504 0.3566148 debye
dipolederiv: -0.5848483 -0.4435263 -0.0126264 -0.5876032 -1.4390061 -0.0577634 -0.0161652 -0.0602307 -0.3056012 -0.5185369 -0.2351845 0.0533236 -0.2155755 -1.0290056 -0.0345677 0.0598047 0.0817308 -0.2739361 -0.8126283 -0.1519722 -0.2195342 -0.0556196 -0.5207143 0.06755 -0.5410599 0.0191003 -0.5962169 -0.4630856 0.2724475 0.0290218 -0.0186081 -0.6538538 -0.0193558 0.0493204 -0.1407153 -0.2746676 0.247784 0.2745191 0.000931 -0.0006322 -0.0655303 0.0110736 -0.0649513 -0.0691227 0.0104516 0.1388926 -0.2191766 -0.0440948 -0.0116511 -0.1360335 -0.0072769 -0.1125556 0.0943179 -0.185655 -0.1268885 0.1519843 0.0581862 0.4530702 0.2552019 -0.0487149 0.0963539 0.0000304 -0.0162794 0.003421 -0.4140258 -0.0969133 -0.346536 0.3403239 0.1257029 -0.0996584 0.2177117 -0.1259901 0.0082972 0.0688625 -0.1185684 0.0903193 -0.0416211 0.1456069 -0.0513851 0.0645589 0.0418205 -0.2247085 -0.2667606 -0.0475935 0.0161083 -0.1235636 -0.0120239 0.0107317 0.0576824 -0.2114401 0.2657392 -0.0087265 -0.1042216 0.1082286 0.0551447 0.0121133 -0.0882631 0.0356621 -0.139511 0.4255546 0.6585252 0.0347563 0.6772764 1.0918016 0.0121361 0.0138781 -0.0134679 0.0701467 -0.0634007 0.0065527 -0.0369583 -0.3259443 -0.2694261 0.0611458 -0.0841717 -0.0114812 -0.175747 0.9474159 0.3841498 0.4107936 0.2513964 1.2121716 -0.217102 0.734744 -0.297101 0.6959718 0.1668048 -0.2301042 -0.0019581 0.141889 0.7610098 0.0446242 0.0642881 0.1294325 0.3349192 0.0188729 -0.067631 0.0381177 -0.0620264 0.0581449 -0.0097079 0.0279054 -0.0101743 0.1878319 0.1561404 0.0178665 0.0460146 -0.004106 0.2323814 -0.0220102 0.0538066 -0.0201178 0.3302426 0.073535 -0.0268852 -0.0622115 0.0392385 -0.0129351 -0.1082183 -0.0066941 -0.0655034 0.0018738 -0.0526042 -0.0274978 0.0635271 -0.087596 0.0313022 0.0620266 0.009547 0.0262381 0.0706276 0.1125401 0.069737 0.0365163 0.0362606 -0.0179094 -0.0291561 0.0316978 -0.0356432 0.1535845 0.040948 0.0551472 0.0382999 0.0920172 -0.0729297 -0.0585774 0.0468877 -0.0520716 0.1522382 -0.0629765 -0.0050932 0.0542926 -0.018771 0.1061425 -0.0046931 0.0550987 -0.0086005 0.1567966 -0.0281282 -0.151728 0.0121887 -0.1157586 -0.0707114 -0.0019971 0.0190035 0.0084494 0.1173737 0.0756382 0.1160951 0.1059875 -0.0225822 0.0003709 0.0329003 0.0479963 -0.0660438 -0.1483052 -0.0258595 0.174281 -0.1146182 -0.0007323 -0.0082853 0.0001184 -0.1136787 0.0179114 -0.037508 0.2820808 -0.001856 -0.1226588 -0.0320619 0.3175298 0.0561666 -0.1424808 0.0974475 0.166979 unknown
polarizability: 168.6719579|18.3500689|161.3501926|-10.1386142|3.1990032|76.6859732 unknown
InChI: InChI=1S/C11H11NO3/c1-15-8-2-3-10-9(5-8)7(6-12-10)4-11(13)14/h2-3,5-6,12-13H,4H2,1H3
charge 0 multiplicity 1
26 atoms
O  2.951694 1.868897 -0.079207
O  -2.323294 2.120562 -0.27979
O  -3.869329 0.530274 -0.968767
N  -0.188084 -2.75227 -0.010963
C  0.055751 -0.496772 0.278234
C  -1.319714 -0.858128 0.572598
C  0.743788 -1.705747 -0.079557
C  -1.428142 -2.237658 0.380847
C  -2.433735 0.070194 1.005145
C  0.758255 0.740609 0.289134
C  2.116449 -1.71184 -0.417722
C  2.126681 0.725278 -0.046568
C  2.80087 -0.486621 -0.395606
C  -2.977115 0.878447 -0.167697
C  2.330156 3.145975 0.266691
H  -2.29934 -2.880569 0.492229
H  0.008629 -3.730891 -0.206363
H  -2.077615 0.769556 1.78187
H  -3.27547 -0.512826 1.414739
H  0.22937 1.665845 0.532261
H  2.640872 -2.634385 -0.689495
H  3.863783 -0.426658 -0.64757
H  3.132856 3.893169 0.178277
H  1.939813 3.137526 1.303856
H  1.506528 3.397196 -0.430853
H  -2.667358 2.595635 -1.084926
