program: Gaussian 09
title: 000223599
version: EM64L-G09RevD.01
frameworkgroup: C1[X(C16H13NO2S)]
method: RPBEPBE
basis: SDD
operation: Freq
keyword: #p
keyword: freq=noraman
keyword: PBEPBE/SDD
title: #p freq=noraman PBEPBE/SDD
converged: YES YES NO NO
title: Mulliken charges:
elementType: S O O N C C C C C C C C C C C C C C C C H H H H H H H H H H H H H
charge: 0.949732 -0.526042 -0.517031 -0.538920 -0.111540 0.381497 0.384587 -0.381900 -0.285989 -0.394009 -0.401867 -0.399736 0.365081 -0.234236 -0.231006 -0.323211 -0.373705 -0.213041 -0.196285 -0.241326 0.290615 0.287525 0.250428 0.286198 0.249494 0.244582 0.236206 0.234825 0.288616 0.225792 0.233240 0.229395 0.232030
chargesum: 0.00000
title: Mulliken charges with hydrogens summed into heavy atoms:
elementType: S O O N C C C C C C C C C C C C C C C C
charge: 0.949732 -0.526042 -0.517031 -0.252722 -0.111540 0.381497 0.384587 -0.091285 0.001536 -0.143581 -0.152373 -0.155154 0.365081 0.001970 0.003819 -0.034595 -0.147913 0.020199 0.033110 -0.009295
polarizability: 2.53506161e+02 1.35414658e+01 2.44909015e+02 1.59069648e+01 -2.27358375e+01 1.70430351e+02
1716.lowfreq: -11.9848 0.0007 0.0009 0.0019 3.7025 6.8037 15.8467 20.1882 35.0547
frequency: 15.3034 20.1085 35.0376 72.6458 95.2168 113.7401 124.5313 183.4257 189.4593 207.1533 215.5094 248.5116 276.9277 305.2183 377.3362 398.7357 402.4269 406.9498 422.0653 437.8990 479.7789 503.2103 507.0424 515.4150 560.3595 570.1836 612.0417 623.2944 638.0024 690.7148 752.6539 758.7689 761.6111 781.5402 784.6582 805.9612 819.7739 824.7585 832.6402 841.3669 880.2040 913.4179 919.8176 923.9383 958.9602 966.8503 972.5099 983.7805 984.2307 993.7847 999.7545 1022.3268 1022.5321 1049.4232 1079.1245 1129.8527 1152.8052 1172.1724 1176.1098 1182.5199 1221.7451 1226.2742 1237.6048 1241.9445 1271.4093 1332.9354 1342.6168 1387.7943 1409.2852 1424.6085 1432.0087 1443.4009 1447.1409 1473.2416 1510.1265 1579.4924 1581.5799 1590.8222 1599.6785 1630.8059 3119.3079 3127.7215 3133.9461 3134.5099 3136.6452 3146.3786 3149.1592 3150.0458 3162.4123 3164.1474 3167.3152 3180.0056 3389.0216
redmass: 4.8669 5.2369 4.1149 5.5366 6.5601 6.8398 5.5713 4.2263 7.5863 8.3725 9.2502 6.1720 6.8022 6.0841 6.4113 3.8703 3.2989 3.7261 2.8430 8.2573 2.5344 3.5423 6.7950 4.0322 5.9233 7.4596 6.1558 6.6636 3.4379 1.8805 4.6979 1.4074 1.4183 2.5611 2.4475 4.1500 3.9423 4.5914 1.3491 1.3787 1.4473 1.4744 2.0051 3.3090 8.4317 1.3579 1.4179 1.9235 2.7795 1.3282 1.3534 2.2020 2.3338 2.3552 1.5729 1.6931 1.2284 1.0570 1.0784 1.1410 1.9518 1.4423 2.4186 1.4626 1.8221 1.2645 1.8017 7.0100 4.9501 6.0943 2.3008 2.2985 2.2439 2.2292 3.7563 6.5749 5.9200 6.6410 5.9136 6.6179 1.0876 1.0862 1.0873 1.0890 1.0885 1.0934 1.0941 1.0938 1.0967 1.0982 1.1006 1.0975 1.0756
irintensity: 0.1542 0.2774 0.1901 0.6682 4.4227 1.4265 2.0445 0.4174 4.8561 6.5130 2.2554 4.6641 0.8229 3.4789 16.1294 12.4828 13.9888 6.3493 19.1862 119.2757 35.8312 12.1036 0.2221 24.9195 3.8862 13.9545 1.8235 6.8928 10.7704 37.8727 0.9262 106.2390 39.5253 3.9890 9.2323 51.8347 0.4402 117.1717 38.1979 27.9613 20.2181 6.4704 3.9825 1.9304 51.4010 2.0312 0.6889 2.3595 1.5243 0.6806 0.0887 3.4620 7.8908 20.6122 13.0554 16.0047 3.4821 0.0473 1.1020 2.6152 6.8933 0.0717 6.9445 2.4072 8.1978 1.9562 9.0322 0.7302 5.6377 0.7889 1.1308 1.1761 10.5044 25.0810 13.8090 8.3144 2.3163 3.3322 2.8081 0.8567 6.1921 1.4234 0.7443 0.1700 7.6536 24.3903 18.8091 6.2587 8.1760 22.7057 30.6071 5.3584 18.7497
temp: 298.150 k
press: 1.00000 atm
elementType: 16 8 8 7 6 6 6 6 6 6 6 6 6 6 6 6 6 6 6 6 1 1 1 1 1 1 1 1 1 1 1 1 1
symmnumber: 1
zpe: 647426.3 jmol-1
zpe.correction: 0.246592 hartree
zpe.thermalcorrener: 0.263926 hartree
zpe.thermalcorrenthalpy: 0.264870 hartree
zpe.thermalcorrgfe: 0.199023 hartree
zpe.sumelectzpe: -1219.205920 hartree
zpe.sumelectthermal: -1219.188585 hartree
zpe.sumelectthermalent: -1219.187641 hartree
zpe.sumelectthermalfe: -1219.253488 hartree
dipole: 4.7328 5.4148 3.0913
dipole: 7.8278
quadrupole: -117.9434 -129.4728 -117.6482
quadrupole: -8.2483 0.1683 -11.1508
quadrupole: 3.7447 -7.7847 4.0400 -8.2483 0.1683 -11.1508
hfenergy: -1219.4525116 hartree
pointgroup: C01 [X(C16H13N1O2S1)]
dipole: 1.924241 2.0527721 1.2522099 debye
polarizability: 253.9405953|13.7105914|243.5787692|16.7481217|-23.3761592|171.3261631 unknown
InChI: InChI=1S/C16H13NO2S/c18-20(19,17-15-8-2-1-3-9-15)16-11-10-13-6-4-5-7-14(13)12-16/h1-12,17H
charge 0 multiplicity 1
33 atoms
S  -1.541369 -2.038488 -0.500154
O  -1.710043 -3.542485 0.089834
O  -1.842621 -1.64161 -2.044209
N  -2.79651 -0.99342 0.564602
C  0.2084 -1.443817 -0.091501
C  2.064034 0.053438 -0.527176
C  2.789066 -0.576436 0.560768
C  0.743563 -0.408188 -0.844314
C  0.888006 -2.091378 0.977427
C  2.17489 -1.651183 1.289193
C  2.684315 1.117864 -1.260758
C  4.109459 -0.112622 0.871005
C  -2.723144 0.419597 0.428115
C  3.971941 1.547151 -0.9326
C  4.689104 0.927515 0.140861
C  -3.107606 1.008227 -0.810768
C  -2.327242 1.254057 1.512847
C  -3.095847 2.410388 -0.949931
C  -2.357959 2.657268 1.372359
C  -2.73168 3.241097 0.138718
H  0.178909 0.030174 -1.674449
H  0.415884 -2.929317 1.499977
H  2.736459 -2.133656 2.097226
H  -2.650186 -1.346981 1.527769
H  2.132687 1.588664 -2.082345
H  4.660721 -0.588076 1.690679
H  4.440896 2.360332 -1.496651
H  5.698924 1.27449 0.384801
H  -3.418421 0.356651 -1.632389
H  -2.013328 0.801032 2.462047
H  -3.393186 2.858715 -1.904308
H  -2.075938 3.293735 2.218367
H  -2.743877 4.330766 0.028159
