program: Gaussian 09
title: 000223595
version: EM64L-G09RevD.01
frameworkgroup: C1[X(C12H14O3)]
method: RPBEPBE
basis: SDD
operation: Freq
keyword: #pfreq=noraman
keyword: PBEPBE/SDD
title: #p freq=noraman PBEPBE/SDD
converged: YES YES NO NO
title: Mulliken charges:
elementType: O O O C C C C C C C C C C C C H H H H H H H H H H H H H H
charge: -0.225466 -0.418357 -0.233378 -0.377589 -0.384538 -0.538878 -0.480712 0.130357 0.288997 0.173444 -0.341428 -0.350842 -0.246296 -0.227000 -0.222435 0.220110 0.194146 0.253448 0.212921 0.231700 0.241995 0.241581 0.260177 0.246787 0.277879 0.230874 0.234080 0.233974 0.374448
chargesum: 0.00000
title: Mulliken charges with hydrogens summed into heavy atoms:
elementType: O O O C C C C C C C C C C C C
charge: -0.225466 -0.043909 -0.233378 0.036667 0.081831 -0.065183 0.021046 0.130357 0.288997 0.173444 -0.094640 -0.072963 -0.015422 0.007080 0.011540
polarizability: 1.86538373e+02 -3.81472028e+00 1.20110913e+02 2.29029145e+01 1.10723267e+01 9.99201339e+01
1716.lowfreq: -11.5282 -5.3164 -0.0007 -0.0006 -0.0004 2.4234 18.1344 22.5199 32.5905
frequency: 18.1055 22.4740 32.5734 57.3558 74.2974 98.8137 133.2395 151.0158 160.0278 240.6453 287.1128 310.8704 381.6261 400.0952 413.2399 455.8805 487.4148 512.7895 568.4942 586.9739 613.6289 636.0658 642.6283 697.2642 712.3605 757.2192 766.6366 853.1161 858.1563 860.4508 881.3473 946.5666 962.7437 989.8105 992.0196 1010.8792 1026.2203 1027.0647 1031.0391 1063.4803 1083.8623 1087.0174 1103.9521 1146.6201 1173.6664 1188.4278 1194.7061 1224.0494 1242.2692 1268.8574 1284.6205 1302.0229 1314.5081 1342.5886 1353.0981 1375.1710 1387.7947 1431.9645 1436.6952 1438.4309 1453.3106 1478.2548 1479.6918 1570.8770 1599.1546 1613.2857 1668.7668 2964.4624 2981.1267 2982.2568 3000.5737 3016.2210 3036.5489 3043.7560 3075.3374 3129.0751 3139.1926 3150.5538 3159.7659 3169.9589 3509.8676
redmass: 10.2239 6.8845 4.6408 4.1216 2.0577 3.4574 3.9064 4.4521 3.8184 2.7284 3.8055 4.4776 5.3269 2.8109 3.2020 5.1363 2.7393 2.1088 2.8340 4.0202 6.3992 3.7104 1.3538 1.8286 1.9407 1.8171 1.6589 3.5371 1.5659 1.5107 2.0777 1.5039 4.5467 6.2575 1.3777 1.3630 2.2249 2.5255 2.0939 2.0205 2.3179 1.6390 2.2269 1.3344 1.0658 1.1289 1.2916 2.3847 1.4784 1.3296 1.3181 1.2054 1.3615 1.6666 1.5992 1.7556 9.2020 1.1774 2.0123 1.0879 1.0837 1.0990 2.1740 6.6087 6.7255 6.5384 8.2198 1.0604 1.0635 1.0622 1.0639 1.0975 1.0936 1.0976 1.1029 1.0851 1.0880 1.0924 1.0960 1.1012 1.0639
irintensity: 1.3991 1.2082 0.2498 1.8627 0.6077 0.2752 3.7396 0.7448 1.3159 0.8131 5.8304 7.5817 15.3037 0.0899 1.0911 19.3339 12.4861 20.8069 4.3849 23.3982 0.2358 6.4619 123.8212 48.3749 17.8092 14.0176 61.7801 0.4988 3.3435 1.9072 7.8974 2.3582 78.9162 3.6954 0.4711 5.3100 3.6517 160.1258 40.7251 19.6408 51.2825 23.7385 1.8116 1.7544 3.6690 30.7970 22.9310 124.4243 2.7743 33.4528 11.2655 31.9537 0.3904 55.4019 31.9165 13.9774 2.6697 20.1868 25.4191 22.3265 18.8326 13.6968 0.8838 86.4382 43.3333 9.1452 203.3483 43.5215 5.8737 31.5259 20.0237 16.2393 16.3597 1.2194 37.7282 0.1167 6.4250 17.2478 21.9264 20.3540 17.9734
temp: 298.150 k
press: 1.00000 atm
elementType: 8 8 8 6 6 6 6 6 6 6 6 6 6 6 6 1 1 1 1 1 1 1 1 1 1 1 1 1 1
symmnumber: 1
zpe: 612034.1 jmol-1
zpe.correction: 0.233111 hartree
zpe.thermalcorrener: 0.247944 hartree
zpe.thermalcorrenthalpy: 0.248888 hartree
zpe.thermalcorrgfe: 0.187545 hartree
zpe.sumelectzpe: -690.247632 hartree
zpe.sumelectthermal: -690.232800 hartree
zpe.sumelectthermalent: -690.231855 hartree
zpe.sumelectthermalfe: -690.293198 hartree
dipole: 2.0884 2.4088 0.2592
dipole: 3.1986
quadrupole: -69.9724 -82.4854 -96.7733
quadrupole: -0.7524 6.1692 1.4143
quadrupole: 13.1046 0.5916 -13.6963 -0.7524 6.1692 1.4143
hfenergy: -690.4807432 hartree
pointgroup: C01 [X(C12H14O3)]
dipole: 0.8539419 -0.7145244 -0.5864183 debye
polarizability: 186.3054106|17.6945757|104.8464661|-15.995579|13.5831379|115.4175425 unknown
InChI: InChI=1S/C12H14O3/c13-11(8-4-5-9-12(14)15)10-6-2-1-3-7-10/h1-3,6-7,14H,4-5,8-9H2
charge 0 multiplicity 1
29 atoms
O  0.222978 -0.005049 1.543033
O  -5.988886 0.314806 0.269279
O  -4.526112 1.404455 -1.165131
C  -1.425041 -1.589641 -0.114768
C  -2.3370 -0.377544 -0.407466
C  0.047681 -1.337546 -0.494649
C  -3.788314 -0.638432 0.037244
C  0.783848 -0.408161 0.481093
C  2.19786 -0.000911 0.165548
C  -4.743705 0.466433 -0.367576
C  2.88597 -0.457973 -0.991301
C  2.867132 0.869913 1.068713
C  4.215072 -0.052429 -1.237798
C  4.19278 1.276019 0.82151
C  4.870947 0.815342 -0.33349
H  -1.477797 -1.835363 0.963206
H  -1.79473 -2.472418 -0.674436
H  -1.94844 0.511494 0.120185
H  -2.322982 -0.140797 -1.488783
H  0.113291 -0.914687 -1.517876
H  0.607632 -2.295547 -0.52838
H  -4.172495 -1.581513 -0.404039
H  -3.855163 -0.771527 1.133203
H  2.391177 -1.130191 -1.699748
H  2.320989 1.209881 1.955026
H  4.739178 -0.409467 -2.131031
H  4.699775 1.948248 1.522247
H  5.902405 1.13062 -0.527107
H  -6.597253 1.043685 -0.031808
