program: Gaussian 09
title: 000223675
version: EM64L-G09RevD.01
frameworkgroup: C1[X(C23H20BrNO4)]
method: RPBEPBE
basis: SDD
operation: Freq
keyword: #p
keyword: freq=noraman
keyword: PBEPBE/SDD
title: #p freq=noraman PBEPBE/SDD
converged: YES YES NO NO
title: Mulliken charges:
elementType: Br O O O O N C C C C C C C C C C C C C C C C C C C C C C C H H H H H H H H H H H H H H H H H H H H
charge: 0.023992 -0.172678 -0.168076 -0.230815 -0.254546 0.128371 -0.311453 -0.325091 -0.695873 0.545775 0.547247 0.224959 -0.419252 -0.376693 -0.393430 -0.366066 0.303293 -0.226915 -0.239402 -0.229157 -0.234651 -0.241861 -0.234940 -0.339306 -0.352957 -0.387243 -0.361630 0.327125 -0.536114 0.295973 0.293201 0.329493 0.228708 0.233678 0.230816 0.242373 0.226155 0.226746 0.231760 0.230484 0.228884 0.233841 0.269722 0.279422 0.261146 0.248090 0.226237 0.229105 0.251551
chargesum: 0.00000
title: Mulliken charges with hydrogens summed into heavy atoms:
elementType: Br O O O O N C C C C C C C C C C C C C C C C C C C C C C C
charge: 0.023992 -0.172678 -0.168076 -0.230815 -0.254546 0.128371 -0.015480 -0.031889 -0.366380 0.545775 0.547247 0.224959 -0.190544 -0.143015 -0.162615 -0.123693 0.303293 -0.000761 -0.012655 0.002603 -0.004167 -0.012977 -0.001098 -0.069584 -0.073535 -0.126097 -0.113540 0.327125 0.170779
polarizability: 3.44144113e+02 5.16066583e+01 2.72221321e+02 1.15805928e-01 -5.42849804e-01 2.39278991e+02
1716.lowfreq: -12.5495 -9.9013 -4.5765 -2.1187 -0.0001 0.0005 0.0006 16.2169 21.0893
frequency: -11.7315 16.1455 20.8919 38.1695 40.0634 47.4072 56.5899 64.9452 69.0318 78.8999 82.1500 94.3753 126.2067 135.8509 143.9641 157.9098 175.5001 196.2178 210.7812 216.0542 237.2299 242.8567 272.3313 293.4910 314.5416 340.2723 384.8740 400.0279 403.7610 404.9534 415.0061 485.2572 496.7102 506.0240 520.6955 529.8324 541.2402 577.8638 600.7527 614.2725 619.0751 625.5907 652.7250 665.8574 688.3724 699.6494 701.9105 705.9381 730.0269 758.0542 767.4754 773.4643 791.6925 824.3504 829.1561 845.1147 847.2709 850.6773 856.0820 866.1805 923.0767 925.8908 968.9222 974.5303 977.1235 978.5694 981.4803 984.6937 987.1101 991.2458 992.7681 996.8226 999.3263 1002.6420 1026.5625 1031.2575 1063.7714 1083.1927 1103.3503 1111.1906 1117.7300 1156.2306 1171.9416 1173.8781 1175.5396 1181.8700 1189.0579 1193.0732 1195.7673 1201.6150 1206.3437 1212.4323 1235.3030 1245.8747 1270.0923 1275.4644 1298.5848 1314.6804 1320.5059 1338.6278 1348.0382 1370.0074 1383.7912 1386.3344 1426.7565 1430.0992 1437.2536 1442.7383 1444.9710 1468.4883 1469.7682 1482.8711 1484.8684 1498.1245 1561.7918 1588.2027 1594.1612 1595.3714 1610.5651 1614.7993 1622.3828 2969.8465 3004.3936 3062.6369 3077.3259 3079.6804 3116.9916 3126.4358 3127.6781 3128.8189 3133.9198 3139.7652 3139.8918 3140.5664 3148.7727 3151.5529 3152.7029 3165.9074 3168.1615 3168.4020 3171.9752
redmass: 4.4891 5.8273 5.8521 5.8382 4.4900 4.2523 6.6988 10.2456 5.1374 5.4862 7.9190 11.6254 5.5545 5.8046 7.7791 5.4775 7.0994 7.5052 1.3981 3.0072 4.4665 4.5902 6.2819 4.6197 6.8282 7.6112 6.6887 2.7801 4.4876 2.8994 3.1265 3.9912 4.4549 3.1481 5.8110 4.2793 5.2656 5.7518 4.8914 6.4388 6.3574 7.0690 7.4052 4.4317 4.8705 2.3097 1.8999 2.1081 5.2071 3.1715 3.2221 2.5655 5.6471 3.3937 1.2822 1.2867 1.8979 1.3560 3.5842 3.2471 1.5621 1.4812 1.8015 1.4049 1.4071 4.1078 4.1884 2.2513 1.8915 5.9603 5.1939 1.3883 1.3547 2.4211 2.2746 2.1641 2.4790 1.6142 2.1537 1.2592 1.3472 1.3479 1.3304 1.0788 1.0648 1.6010 1.4460 1.4060 1.3471 1.8260 1.7652 1.8015 1.7130 2.4460 2.0470 1.7775 1.5990 1.3454 1.3153 1.3003 1.3051 4.8472 7.2799 7.4075 4.1875 3.5579 1.2620 2.1886 2.1599 1.0498 1.0688 2.2673 2.2854 2.3810 7.5321 7.9112 6.0593 6.0231 6.0798 6.1338 6.9759 1.0325 1.0805 1.1045 1.0842 1.0857 1.0873 1.0856 1.0867 1.0879 1.1001 1.0899 1.0915 1.0918 1.0879 1.0956 1.0962 1.1013 1.0955 1.1015 1.0960
irintensity: 0.5199 0.6018 0.4294 0.2994 0.1743 0.1835 0.2400 0.4377 1.8447 0.2840 0.5661 0.4982 11.2021 4.1627 1.8914 1.2105 1.4717 2.5934 0.3720 0.2284 0.2560 1.9304 0.3309 1.2737 1.3644 0.3897 0.0559 0.0518 1.3314 0.2358 0.4590 3.2854 6.2556 4.5050 17.0368 36.4765 16.6638 39.6454 17.2276 0.0806 1.7728 2.5938 4.5350 19.0806 13.1517 49.4535 82.9883 25.9447 1.2973 5.7086 5.1308 33.3924 10.8128 13.7712 1.7575 2.9245 73.1304 0.7642 11.5917 6.6283 2.5844 3.8146 32.1112 0.2215 0.5312 79.8892 2.2395 3.3233 5.0342 2.5236 3.9061 0.2993 0.1898 3.5540 3.8263 5.7692 0.7920 16.0450 3.8670 0.1510 16.4111 4.1868 67.1923 20.1059 1.7348 169.0989 15.0479 9.9097 14.9233 53.1554 36.2710 111.9826 17.1222 166.4721 44.2774 104.2263 13.3078 16.4349 17.1221 3.5561 8.7300 42.9672 0.2381 2.7448 108.2147 2.3442 10.8040 18.5565 13.9755 15.1869 55.8404 11.2795 12.7032 42.3472 26.5252 222.3904 0.0232 1.3163 0.5596 3.8630 140.1794 68.1009 2.3140 39.5382 6.0296 1.2967 7.4316 4.8047 0.1542 0.2968 21.8227 0.1879 17.6564 15.0112 1.0814 17.5313 35.2473 17.0233 11.0799 19.8135 7.0742
temp: 298.150 k
press: 1.00000 atm
elementType: 35 8 8 8 8 7 6 6 6 6 6 6 6 6 6 6 6 6 6 6 6 6 6 6 6 6 6 6 6 1 1 1 1 1 1 1 1 1 1 1 1 1 1 1 1 1 1 1 1
symmnumber: 1
zpe: 980140.9 jmol-1
zpe.correction: 0.373316 hartree
zpe.thermalcorrener: 0.399162 hartree
zpe.thermalcorrenthalpy: 0.400106 hartree
zpe.thermalcorrgfe: 0.313959 hartree
zpe.sumelectzpe: -1255.398579 hartree
zpe.sumelectthermal: -1255.372733 hartree
zpe.sumelectthermalent: -1255.371789 hartree
zpe.sumelectthermalfe: -1255.457936 hartree
dipole: 2.3042 4.4774 4.4745
dipole: 6.7363
quadrupole: -130.9814 -181.6495 -185.8456
quadrupole: 7.5822 -1.0559 5.8077
quadrupole: 35.1774 -15.4906 -19.6868 7.5822 -1.0559 5.8077
hfenergy: -1255.7718945 hartree
pointgroup: C01 [X(C23H20Br1N1O4)]
dipole: 0.6916709 -0.2511478 2.5460731 debye
polarizability: 337.889478|29.8275052|252.1064321|46.8230903|18.178485|265.6485152 unknown
InChI: InChI=1S/C23H20BrNO4/c1-29-19-14-12-18(13-15-19)23(26)21(24)20(16-8-4-2-5-9-16)22(25(27)28)17-10-6-3-7-11-17/h2-15,20-22H,1H3
charge 0 multiplicity 1
49 atoms
Br -0.696899 -1.156749 -3.55439
O  1.576193 -2.361706 -1.848015
O  -2.256562 2.595053 -2.736296
O  -0.409255 2.691434 -1.409448
O  5.675069 1.474354 1.333546
N  -1.495843 2.126269 -1.82176
C  -0.707654 -0.054448 -0.758743
C  -1.948552 0.805302 -1.122984
C  0.243935 -0.300001 -1.979132
C  -1.112232 -1.328261 -0.010754
C  -2.812433 1.202017 0.069271
C  1.481143 -1.135872 -1.571182
C  -0.450763 -1.645518 1.202365
C  -2.115515 -2.209509 -0.488222
C  -4.19886 0.917556 0.047969
C  -2.254289 1.866548 1.190366
C  2.551804 -0.420961 -0.805916
C  -0.774249 -2.816876 1.920965
C  -2.440756 -3.38163 0.228634
C  -5.017551 1.274697 1.141485
C  -3.073758 2.228977 2.279904
C  -1.77217 -3.691037 1.434743
C  -4.456602 1.93118 2.260439
C  2.573309 0.988668 -0.578909
C  3.620571 -1.204637 -0.290954
C  3.625371 1.582456 0.134178
C  4.678721 -0.623463 0.427616
C  4.682565 0.781831 0.641652
C  6.810807 0.7092 1.865014
H  -0.09612 0.555155 -0.065281
H  -2.559195 0.31378 -1.89697
H  0.561498 0.669738 -2.393481
H  0.324549 -0.971251 1.587238
H  -2.635167 -1.998826 -1.428382
H  -4.636062 0.413354 -0.821806
H  -1.187376 2.117977 1.207129
H  -0.250079 -3.045239 2.855593
H  -3.213379 -4.055713 -0.157605
H  -6.08807 1.044381 1.119166
H  -2.636945 2.745605 3.1414
H  -2.025911 -4.602054 1.988093
H  -5.09104 2.212263 3.108203
H  1.779966 1.63992 -0.961789
H  3.5970 -2.28388 -0.475208
H  3.657347 2.66212 0.306556
H  5.485129 -1.256061 0.809634
H  6.476076 -0.036294 2.611114
H  7.366952 0.20463 1.052491
H  7.454682 1.457216 2.348966
