program: Gaussian 09
title: 000223585
version: EM64L-G09RevD.01
frameworkgroup: C1[X(C8H8Cl6O4)]
method: RPBEPBE
basis: SDD
operation: Freq
keyword: #p
keyword: freq=noraman
keyword: PBEPBE/SDD
title: #p freq=noraman PBEPBE/SDD
converged: NO YES NO NO
title: Mulliken charges:
elementType: Cl Cl Cl Cl Cl Cl O O O O C C C C C C C C H H H H H H H H
charge: 0.146246 0.111841 0.075503 0.145841 0.111267 0.076418 -0.235746 -0.235785 -0.391033 -0.391540 0.137573 0.138146 -0.508326 -0.508021 0.075220 0.075210 -0.627231 -0.626943 0.282571 0.285076 0.281825 0.285434 0.287653 0.287851 0.360358 0.360590
chargesum: 0.00000
title: Mulliken charges with hydrogens summed into heavy atoms:
elementType: Cl Cl Cl Cl Cl Cl O O O O C C C C C C C C
charge: 0.146246 0.111841 0.075503 0.145841 0.111267 0.076418 -0.235746 -0.235785 -0.030675 -0.030950 0.137573 0.138146 0.059322 0.059238 0.362873 0.363062 -0.627231 -0.626943
polarizability: 1.75453246e+02 -2.55537421e+00 1.44252572e+02 -9.28715696e+00 6.40550585e-01 1.46300430e+02
1716.lowfreq: -7.3318 -3.8251 -0.0023 0.0008 0.0014 6.0058 15.6666 42.1947 53.7613
frequency: 15.3330 42.1901 53.7449 65.6320 84.8137 90.3779 126.4539 147.6194 169.9127 190.0526 196.4872 228.0078 232.2758 248.6313 263.3820 265.4140 276.3996 302.6064 311.0576 326.9865 344.7914 363.3640 367.3959 408.8275 455.8821 460.3954 514.7881 515.8648 534.6107 567.6295 619.9832 637.9999 683.4909 688.4546 721.9710 722.8098 737.8763 745.3382 797.3186 816.6658 885.2610 887.8789 985.3926 1002.8072 1018.4042 1051.7809 1052.3477 1074.1791 1087.4560 1096.0905 1100.3077 1178.8456 1190.3029 1204.6137 1275.2545 1282.1910 1287.1511 1302.3654 1322.9778 1330.2405 1351.1990 1372.5636 1452.0012 1455.3465 3036.4162 3036.9333 3058.3693 3059.5596 3132.3941 3134.2225 3507.1407 3514.8869
redmass: 12.4698 27.0744 12.2088 14.3927 7.8137 10.6598 20.8091 8.9285 18.4548 11.8218 10.6699 8.6174 5.3769 6.2938 14.7286 17.2168 2.6895 2.3469 5.2428 4.5243 3.3273 7.4502 6.0981 5.0139 1.5839 4.6658 4.4641 4.2206 5.4096 7.4805 6.3051 7.2863 5.8124 6.1434 5.5423 5.4019 8.7548 5.9650 4.1455 3.4223 3.9092 3.9963 6.4894 4.8963 3.7178 2.7549 3.1548 3.2056 2.9446 2.6674 3.6490 3.7480 1.2910 1.3438 1.2690 1.2112 1.2420 1.4691 1.3394 1.3195 1.8475 2.0499 1.0850 1.0833 1.0857 1.0858 1.0614 1.0612 1.1037 1.1038 1.0654 1.0651
irintensity: 0.3798 0.0989 1.4088 0.2866 1.2646 0.0898 0.2086 0.0038 0.1052 0.2504 1.4089 13.7473 0.3109 0.4240 7.2997 0.0139 20.5299 79.3022 19.6678 11.3740 19.6916 12.3910 42.7425 10.1396 62.5776 140.0399 29.1560 23.6915 21.4000 16.3073 32.9467 26.0118 35.1980 26.6030 39.8803 44.3540 251.8778 60.3441 26.7468 120.9770 97.5313 122.1902 81.8131 32.0265 77.8073 28.4424 44.5748 26.5344 35.1528 119.4448 24.9303 3.5818 30.2084 42.1258 14.6970 4.7164 12.0049 72.9985 5.0662 7.8901 85.9047 22.2473 19.4131 15.6067 12.9548 8.5173 1.0146 0.8026 0.3497 0.3211 58.5646 36.8915
temp: 298.150 k
press: 1.00000 atm
elementType: 17 17 17 17 17 17 8 8 8 8 6 6 6 6 6 6 6 6 1 1 1 1 1 1 1 1
symmnumber: 1
zpe: 413128.7 jmol-1
zpe.correction: 0.157352 hartree
zpe.thermalcorrener: 0.176584 hartree
zpe.thermalcorrenthalpy: 0.177528 hartree
zpe.thermalcorrgfe: 0.107766 hartree
zpe.sumelectzpe: -3369.481138 hartree
zpe.sumelectthermal: -3369.461907 hartree
zpe.sumelectthermalent: -3369.460963 hartree
zpe.sumelectthermalfe: -3369.530725 hartree
dipole: -0.0117 -0.7900 0.2317
dipole: 0.8234
quadrupole: -155.3768 -143.6692 -149.7584
quadrupole: -1.3689 -5.1404 -1.8674
quadrupole: -5.7753 5.9323 -0.1570 -1.3689 -5.1404 -1.8674
hfenergy: -3369.6384906 hartree
pointgroup: C01 [X(C8H8Cl6O4)]
dipole: 0.0032681 -0.3235986 0.0144694 debye
dipolederiv: -0.238555 0.1166733 -0.1742626 0.1107679 -0.2839736 0.2526109 -0.2045106 0.2533247 -0.5060826 -0.3946079 0.1134373 0.2637113 0.1262603 -0.1968909 -0.1643844 0.2734383 -0.1602409 -0.5837281 -0.2772352 -0.0134115 -0.0018914 -0.0093952 -0.761263 -0.0802029 -0.0336029 -0.0816392 -0.1630481 -0.2411788 -0.136545 -0.1623771 -0.1339598 -0.3420255 -0.2701882 -0.192284 -0.269793 -0.4456338 -0.3943519 -0.0809943 0.2745598 -0.0926012 -0.1648172 0.1157105 0.2851037 0.1108557 -0.6169386 -0.276058 0.0113646 -0.0030222 0.0056036 -0.7343726 0.1446094 -0.0347578 0.1459856 -0.1884583 -1.0620276 0.3427753 0.1963497 0.3708201 -0.5784391 -0.1713903 0.1089421 -0.0559222 -0.4073969 -1.0707869 -0.3153585 0.2393193 -0.3542023 -0.5436793 0.1850077 0.1518988 0.0708948 -0.4348016 -0.527916 -0.1265001 -0.1921928 -0.0191188 -0.8119985 -0.1819082 -0.2105316 -0.1413123 -0.4556822 -0.5193917 0.0997119 -0.2021861 -0.0110874 -0.7734726 0.2216523 -0.2093347 0.1806769 -0.4971604 0.9634791 -0.0727782 0.0317176 -0.2703003 0.9341143 0.3513439 0.0919361 0.102593 0.266442 0.9681608 0.0777961 0.0150495 0.2799473 0.8718202 -0.4216462 0.057702 -0.1727406 0.324105 -0.2694128 0.0754496 -0.0603773 0.0397 -0.0154796 0.0266627 0.1512036 0.0117975 -0.0673769 -0.2713293 -0.0786738 -0.0532136 -0.0190618 -0.0191971 -0.0309979 0.1547821 -0.0193199 -0.061432 0.6252771 -0.1060394 -0.1093451 -0.1844397 0.0663128 0.0599416 -0.3076921 0.1567107 0.1568821 0.6243115 0.0883261 -0.1224484 0.1462804 0.0425884 -0.0468001 -0.3312338 -0.1423287 0.1805036 0.7468146 -0.158257 -0.0493592 -0.1957837 1.290908 -0.0054512 -0.0313183 -0.0180037 1.3052229 0.7510913 0.1548381 -0.0652899 0.1927904 1.2907175 0.0070484 -0.0512514 0.0195084 1.3033723 0.0369737 -0.0592979 0.044328 -0.050631 0.0248601 0.0295892 0.0184999 -0.0058092 0.107452 0.0998812 0.0058043 -0.0221232 0.0091677 0.0496116 -0.0668741 -0.022357 -0.0408063 0.0282486 0.0399894 0.0634733 0.0365216 0.0514578 0.0210861 -0.0195478 0.0124208 0.0171172 0.1090388 0.1005657 -0.0091972 -0.0192266 -0.0125031 0.0628562 0.0630967 -0.0198376 0.0371755 0.0155086 -0.0059702 -0.0238341 0.0039716 0.0687755 -0.0562673 -0.0214086 0.034432 -0.0300564 0.0422746 -0.005766 0.0243398 0.0015386 -0.0641355 -0.0489937 0.0319349 0.0426568 0.0402975 0.0345298 0.3018515 -0.0886628 0.0698224 -0.0820562 0.3411155 0.0112259 0.1370296 0.0258594 0.2740102 0.2961915 0.0955601 0.0604264 0.0977052 0.3348792 -0.0196342 0.1286659 -0.0348245 0.2801491 unknown
polarizability: 175.9156375|-0.6871871|144.0786417|-8.8714054|0.1327566|146.011968 unknown
InChI: InChI=1S/C8H8Cl6O4/c9-7(10,11)3-1-5(15)6(16,17-3)2-4(18-5)8(12,13)14/h3-4,15-16H,1-2H2
charge 0 multiplicity 1
26 atoms
Cl 4.026534 -1.266151 1.526962
Cl 4.368902 -0.909036 -1.457422
Cl 3.723897 1.484411 0.303998
Cl -3.980022 -1.401702 -1.476583
Cl -4.31047 -0.707839 1.449786
Cl -3.656003 1.467348 -0.573276
O  1.134678 -0.287984 1.004749
O  -1.082201 -0.385679 -1.075229
O  0.426718 2.017186 1.216218
O  -0.33702 1.86789 -1.542959
C  0.100591 0.734095 0.691858
C  -0.030912 0.646689 -0.877158
C  1.302233 0.111019 -1.407071
C  -1.240616 0.282977 1.276348
C  1.911872 -0.644468 -0.20007
C  -1.857023 -0.601813 0.16456
C  3.41014 -0.350621 0.046151
C  -3.353936 -0.327723 -0.110527
H  1.925922 0.95965 -1.729951
H  1.135653 -0.553092 -2.266876
H  -1.853457 1.172994 1.489433
H  -1.086865 -0.275372 2.210364
H  1.834678 -1.740716 -0.322683
H  -1.784629 -1.677537 0.410235
H  1.325779 2.295145 0.895453
H  -1.232141 2.193026 -1.258109
