program: Gaussian 09
title: 000223584
version: EM64L-G09RevD.01
frameworkgroup: C1[X(C8H5NO4)]
method: RPBEPBE
basis: SDD
operation: Freq
keyword: #pfreq=noraman
keyword: PBEPBE/SDD
title: #p freq=noraman PBEPBE/SDD
converged: NO YES NO NO
title: Mulliken charges:
elementType: O O O O N C C C C C C C C H H H H H
charge: -0.217905 -0.193514 -0.197974 -0.188281 0.021729 0.298194 0.113135 -0.406062 -0.343202 -0.491440 0.157882 0.415874 -0.356504 0.255739 0.255774 0.322136 0.259223 0.295196
chargesum: 0.00000
title: Mulliken charges with hydrogens summed into heavy atoms:
elementType: O O O O N C C C C C C C C
charge: -0.217905 -0.193514 -0.197974 -0.188281 0.021729 0.298194 0.113135 0.105451 -0.083979 -0.169305 0.157882 0.415874 -0.061307
polarizability: 1.48728229e+02 1.85820189e+00 1.25366077e+02 2.39561300e-03 8.70113189e-04 4.40886805e+01
1716.lowfreq: -8.7524 -6.9278 -0.0008 -0.0004 0.0008 5.0782 54.2299 96.5686 152.9688
frequency: 54.2291 96.5679 152.9686 164.2735 197.5653 279.7298 282.2915 335.1425 417.9795 483.4772 483.7022 525.8757 557.7656 614.9066 641.7011 676.4321 710.0479 737.2270 737.9916 777.6693 850.5314 867.1595 943.8661 958.5102 970.7080 989.4943 1004.5181 1056.7991 1118.9068 1140.3999 1173.4857 1206.3026 1222.6575 1250.7476 1307.1578 1373.6215 1423.0361 1433.5150 1448.9334 1463.9063 1606.3549 1621.9774 1715.0239 3013.8405 3071.3440 3155.6519 3183.3686 3185.7197
redmass: 13.8590 7.1120 5.6550 11.9523 3.6763 3.6900 8.8274 9.6704 3.0304 6.6862 5.7618 5.3962 8.2445 8.8545 6.6056 8.2483 3.6851 6.5362 9.5575 6.3376 1.3634 5.9485 10.9135 1.4712 5.1295 1.5489 1.5621 2.1040 2.0033 1.0761 2.2169 4.4323 4.6157 1.3755 1.5857 9.4779 7.7968 4.4771 1.3697 1.9365 8.7740 7.7024 12.9773 1.0577 1.1067 1.0911 1.0937 1.0954
irintensity: 1.2834 0.7335 2.8261 4.3407 3.1988 7.5224 2.8105 1.5745 1.7792 4.6862 6.0994 0.5099 1.5599 12.5503 12.1310 2.4216 20.7586 5.0065 29.5430 0.5666 27.8404 4.7731 55.2460 17.2889 113.6128 4.5254 0.1843 62.5179 10.8513 0.2192 9.5338 186.7907 85.9684 1.2655 4.3850 81.4795 0.6298 39.0421 31.0659 0.0764 3.5574 42.1893 346.3715 13.2516 5.7109 5.3924 6.8875 5.0074
temp: 298.150 k
press: 1.00000 atm
elementType: 8 8 8 8 7 6 6 6 6 6 6 6 6 1 1 1 1 1
symmnumber: 1
zpe: 315126.8 jmol-1
zpe.correction: 0.120025 hartree
zpe.thermalcorrener: 0.129994 hartree
zpe.thermalcorrenthalpy: 0.130938 hartree
zpe.thermalcorrgfe: 0.083732 hartree
zpe.sumelectzpe: -662.503412 hartree
zpe.sumelectthermal: -662.493443 hartree
zpe.sumelectthermalent: -662.492499 hartree
zpe.sumelectthermalfe: -662.539705 hartree
dipole: -1.6144 -6.2463 -0.0083
dipole: 6.4516
quadrupole: -97.0686 -72.3547 -71.9289
quadrupole: 9.5239 0.0231 -0.0221
quadrupole: -16.6179 8.0960 8.5219 9.5239 0.0231 -0.0221
hfenergy: -662.6234371 hartree
pointgroup: C01 [X(C8H5N1O4)]
dipole: 0.6213744 -2.4610175 0.0037481 debye
dipolederiv: -0.7170503 0.3601442 -0.0008908 0.1219392 -0.8455557 0.0004303 0.0009074 -0.0023116 -0.2940115 -0.5801177 -0.1996627 -0.0003481 -0.2371301 -1.1139448 -0.0018796 0.0007151 0.003593 -0.3157448 -0.8237145 -0.1633556 -0.0001244 -0.0980316 -0.5418589 -0.0000704 -0.0000336 -0.0001098 -0.2213003 -0.5868022 0.1530156 -0.0000664 0.1414595 -0.731699 0.0000132 -0.0000504 -0.0000565 -0.2149823 1.6653819 -0.1400338 0.0002802 -0.2255335 1.1062673 0.0000507 0.000231 0.0002942 0.1890551 0.2852845 -0.1525872 -0.0003096 0.0277445 0.0628233 0.0001623 -0.0015211 -0.0000647 -0.0419914 -0.4905966 -0.1010634 0.0006217 -0.0246335 -0.31533 0.0002078 -0.0009631 -0.0001219 0.0264445 0.0839441 0.1821905 0.0006033 0.0886759 0.3994889 -0.0003348 0.0004988 -0.0007038 0.3217226 -0.3898383 -0.0081028 -0.0000118 -0.0675597 0.2069184 0.0001359 0.000182 0.0001172 -0.1286333 0.2365867 -0.0323912 0.0001046 0.0561555 -0.0173808 0.0001229 -0.0004313 -0.000353 -0.0579163 1.3225268 0.0091779 0.0003843 0.3210902 1.700894 0.0012534 0.000583 -0.0003303 0.2594101 -0.5016706 0.1167223 -0.0000648 0.1325571 -0.1212729 -0.0000453 -0.000011 -0.0000142 0.0558722 0.0937909 0.0070597 0.0000872 -0.2252654 0.0448774 -0.0000941 -0.0000371 -0.0000802 -0.0849356 0.0477079 -0.0086046 -0.0360164 -0.0088116 0.0026703 0.0534428 -0.0587923 0.0924899 0.0032185 0.0479917 -0.0089733 0.0357155 -0.009115 0.0028022 -0.0532843 0.0585945 -0.0919862 0.0033153 0.146306 0.0078643 0.0000302 0.0099545 0.1011726 -0.0000414 -0.0000467 -0.0001619 0.1739281 0.0730699 0.0422198 0.0000363 0.0224383 -0.0533602 -0.0000566 0.0003678 -0.0002126 0.1568751 0.0871997 -0.0636196 -0.0000308 -0.0259342 0.1124878 -0.0000129 -0.000193 0.0000124 0.1696739 unknown
polarizability: 148.7066953|-1.9888509|125.3876073|0.0002814|-0.0169293|44.088684 unknown
InChI: InChI=1S/C8H5NO4/c10-8-7-3-6(9(11)12)2-1-5(7)4-13-8/h1-3H,4H2
charge 0 multiplicity 1
18 atoms
O  3.250853 0.042938 -0.001303
O  2.455389 2.247775 -0.0028
O  -3.79409 -0.46568 -0.00058
O  -3.018047 1.679558 -0.000378
N  -2.840358 0.403261 -0.00044
C  1.15797 -1.094891 0.000659
C  0.917031 0.296852 0.0011
C  2.655317 -1.320515 -0.000623
C  0.088609 -2.011305 0.000415
C  -0.383015 0.830603 0.000198
C  2.213533 1.033336 0.003448
C  -1.439762 -0.102536 -0.000106
C  -1.228159 -1.503835 0.000142
H  3.01836 -1.846898 0.900016
H  3.016469 -1.846913 -0.902028
H  -0.573791 1.907088 0.000549
H  0.261651 -3.091859 -0.000058
H  -2.098062 -2.166078 -0.00021
