program: Gaussian 09
title: 000223583
version: EM64L-G09RevD.01
frameworkgroup: C1[X(C7H11NO4S)]
method: RPBEPBE
basis: SDD
operation: Freq
keyword: #p
keyword: freq=noraman
keyword: PBEPBE/SDD
title: #p freq=noraman PBEPBE/SDD
converged: YES YES NO NO
title: Mulliken charges:
elementType: S O O O O N C C C C C C C H H H H H H H H H H H
charge: -0.018291 -0.409783 -0.217303 -0.251378 -0.229026 -0.201046 -0.112742 -0.741239 0.195639 0.310510 0.240205 -0.738521 -0.795383 0.287663 0.316757 0.305866 0.264679 0.244346 0.258423 0.263174 0.273433 0.249255 0.113918 0.390842
chargesum: 0.00000
title: Mulliken charges with hydrogens summed into heavy atoms:
elementType: S O O O O N C C C C C C C
charge: 0.095627 -0.018941 -0.217303 -0.251378 -0.229026 -0.201046 0.174921 -0.118616 0.195639 0.310510 0.240205 0.028927 -0.009521
polarizability: 1.26152832e+02 1.88731202e+00 1.07655724e+02 1.07644605e+00 5.57705088e+00 9.46779039e+01
1716.lowfreq: -7.9684 -0.0011 0.0016 0.0021 5.9090 11.6283 39.3270 48.1485 55.5146
frequency: 39.1917 48.0174 55.5117 67.9605 96.9355 137.6198 146.3528 213.5266 216.4892 241.5704 252.4793 257.6429 266.4676 339.1655 363.7655 390.1191 405.0026 450.0633 508.6456 545.5967 553.9023 580.1044 616.2328 632.7824 645.7714 702.4251 704.9543 785.8167 879.6054 913.4346 954.8487 993.5979 1036.0899 1039.5956 1046.5941 1064.6075 1071.1912 1135.1682 1184.7628 1231.1788 1257.5804 1268.2743 1293.5737 1302.3959 1353.3299 1381.5132 1391.4860 1426.6084 1445.0596 1446.2805 1463.4591 1478.9376 1598.4406 1623.5145 1661.1590 2443.0684 2987.1774 3012.4053 3071.5814 3077.8967 3078.8870 3102.1203 3130.0675 3133.1260 3159.5923 3520.5137
redmass: 6.3635 4.4456 6.4793 4.9706 4.5156 8.0035 7.8600 1.0900 2.0795 1.2174 1.2286 4.3591 4.1740 6.1087 4.7263 5.7196 4.5132 3.1946 3.6571 3.3074 2.8008 3.4017 2.5425 2.7941 2.3669 2.6650 4.1193 1.4411 6.0912 2.4485 2.1235 1.7795 1.9564 1.7286 1.9964 2.7952 2.1179 3.9414 1.3619 1.9323 3.1673 1.6535 1.2929 2.3762 1.4020 1.2366 1.2145 1.1057 1.0555 1.0765 1.0752 1.0467 7.1125 8.8388 9.8763 1.0383 1.0382 1.0359 1.0797 1.0967 1.0621 1.0957 1.0981 1.1032 1.1062 1.0641
irintensity: 2.9249 4.4595 3.6995 0.7591 4.4018 1.5154 0.8667 1.6899 5.6055 19.4325 6.8697 4.1155 4.6643 5.6159 1.6765 0.5086 0.1759 3.4518 13.2167 55.5490 4.3639 74.0993 18.7093 28.7309 64.4901 35.7975 19.1302 3.9150 14.5291 6.5665 11.1831 110.3791 12.3341 4.6483 9.4985 72.9084 164.2914 19.4513 105.9837 240.5174 62.7354 113.2896 13.0756 58.6744 17.0159 83.8347 53.2476 39.5702 12.6568 23.4009 21.0055 17.5954 78.8042 259.9131 204.5058 21.3733 2.9413 2.4104 7.5052 2.7080 1.4812 2.7471 7.5447 14.5257 0.3658 40.9568
temp: 298.150 k
press: 1.00000 atm
elementType: 16 8 8 8 8 7 6 6 6 6 6 6 6 1 1 1 1 1 1 1 1 1 1 1
symmnumber: 1
zpe: 466082.1 jmol-1
zpe.correction: 0.177521 hartree
zpe.thermalcorrener: 0.192343 hartree
zpe.thermalcorrenthalpy: 0.193287 hartree
zpe.thermalcorrgfe: 0.134861 hartree
zpe.sumelectzpe: -1026.053490 hartree
zpe.sumelectthermal: -1026.038668 hartree
zpe.sumelectthermalent: -1026.037724 hartree
zpe.sumelectthermalfe: -1026.096151 hartree
dipole: -1.1548 1.1166 1.2616
dipole: 2.0426
quadrupole: -82.5051 -92.8609 -81.9745
quadrupole: 1.3840 -5.3513 3.8173
quadrupole: 3.2751 -7.0808 3.8057 1.3840 -5.3513 3.8173
hfenergy: -1026.2310114 hartree
pointgroup: C01 [X(C7H11N1O4S1)]
dipole: 0.4976416 0.4891858 -0.3985687 debye
dipolederiv: -0.0995506 0.1841801 -0.0607754 0.108021 -0.0767878 -0.1797624 -0.0807826 -0.1840202 -0.2656299 -1.2628653 -0.2088687 -0.2123021 -0.1138122 -0.3153835 0.0056675 -0.1786551 -0.0135473 -0.4352766 -0.6382559 0.0841084 0.0024717 -0.0265532 -0.7819819 -0.4022428 -0.0182076 -0.2878988 -0.6012265 -0.87166 0.0918613 -0.2272671 0.0373203 -0.5558553 0.2163748 -0.1218335 0.2450851 -0.6561524 -1.0570684 -0.0512843 -0.1963905 -0.1892715 -0.420485 0.1138539 0.0187212 0.1630356 -0.470915 -0.8401515 0.0175091 -0.2673563 0.2496918 -0.811231 0.5752536 -0.5351447 0.4778988 -0.9833059 0.2243619 0.2872591 0.0376595 0.317904 0.031523 -0.0236922 -0.0816242 0.0847431 0.1267862 0.0671848 -0.2569384 -0.0467926 -0.14045 0.228356 0.1070023 -0.0384505 0.1497153 0.08712 1.5831927 -0.0714911 0.1241949 -0.0125595 0.8960395 0.4671296 0.0691915 0.3602394 0.6892592 0.9139862 0.1649582 0.0628044 -0.0474891 0.9680465 -0.6943873 0.2863019 -0.6938644 0.8888926 1.5489373 -0.072934 0.5346832 -0.0332778 0.5250395 -0.4817395 0.4607635 -0.4683961 0.968527 -0.3372262 -0.2193256 0.0986071 -0.1469142 -0.0441517 0.0122942 0.0074912 -0.0072824 0.0288668 -0.0512474 -0.0868278 0.0563459 -0.0272948 -0.1868643 0.2292621 -0.0032385 0.2079067 -0.2772063 0.0963412 0.0017811 0.0029364 -0.0330995 0.0572755 0.0469183 0.0415814 0.0194805 0.0124864 0.0825163 0.0673596 0.0281092 0.0901259 0.0159124 0.0628473 0.0202262 -0.0100374 0.0155188 -0.007446 -0.0467529 0.0211615 -0.0541798 0.0483576 -0.006311 0.0172403 -0.0045416 0.1090351 0.1030641 -0.020372 -0.0043736 -0.0283841 0.1010791 -0.0325518 -0.0207975 -0.0623011 -0.0123702 0.0901752 0.0481444 -0.0560328 -0.0114702 -0.0006298 0.1059408 0.0000465 0.1217214 0.0049367 0.067056 0.0430035 0.0389964 0.0735161 0.0194606 -0.0498659 0.035535 -0.0249865 0.1118321 0.0921636 -0.0581952 -0.0039022 -0.06082 0.0079201 -0.0282877 -0.002063 -0.0569986 0.1013781 -0.0317883 0.0348421 -0.1128143 -0.0040253 0.1192986 0.0071915 -0.0500951 0.0303713 0.0613501 0.0100749 0.0605283 0.0911629 0.0605633 0.0562482 -0.0408258 0.0763801 -0.0032079 0.0546227 -0.0395586 -0.0254877 0.0796354 -0.1075283 -0.0522081 0.0943517 0.074219 0.0742927 0.1240157 0.3577641 0.0329425 0.0092385 0.099987 0.1710219 -0.1044213 0.0231945 -0.1174079 0.3174554 unknown
polarizability: 125.7279767|-1.982577|108.8993559|3.4421976|-4.009833|93.8591279 unknown
InChI: InChI=1S/C7H11NO4S/c1-4(9)8(5(2)10)6(3-13)7(11)12/h6,11,13H,3H2,1-2H3
charge 0 multiplicity 1
24 atoms
S  0.098632 2.867255 1.152099
O  3.093352 -0.328004 -0.155422
O  1.564591 -1.621655 -1.333773
O  0.436863 -1.433791 1.496603
O  -2.818975 -0.085451 -0.727137
N  -0.547751 -0.104355 -0.118695
C  0.810488 0.489624 -0.2751
C  1.232357 1.367589 0.923928
C  1.813724 -0.62927 -0.62136
C  -0.626448 -1.141573 0.877126
C  -1.645454 0.316218 -0.941919
C  -1.928004 -1.854839 1.152102
C  -1.339829 1.264636 -2.094792
H  0.7852 1.139186 -1.165323
H  1.268695 0.78699 1.854421
H  2.227609 1.795746 0.734918
H  -2.332751 -2.319443 0.237352
H  -1.724043 -2.623086 1.91361
H  -2.708905 -1.160108 1.501952
H  -0.980271 2.242925 -1.727136
H  -2.280231 1.417834 -2.643843
H  -0.588958 0.844501 -2.788483
H  -0.966841 2.1812 1.711959
H  3.718246 -1.055928 -0.42049
