program: Gaussian 09
title: 000223580
version: EM64L-G09RevD.01
frameworkgroup: C1[X(C4H8S2)]
method: RPBEPBE
basis: SDD
operation: Freq
keyword: #p
keyword: freq=noraman
keyword: PBEPBE/SDD
title: #p freq=noraman PBEPBE/SDD
converged: YES YES NO NO
title: Mulliken charges:
elementType: S S C C C C H H H H H H H H
charge: 0.305711 0.083926 -0.322374 -0.645112 -0.521006 -0.862168 0.251233 0.221165 0.244706 0.213954 0.226393 0.265227 0.267948 0.270397
chargesum: 0.00000
title: Mulliken charges with hydrogens summed into heavy atoms:
elementType: S S C C C C
charge: 0.305711 0.083926 0.150024 0.039941 -0.521006 -0.058596
polarizability: 1.15803983e+02 -5.72159623e+00 7.15466339e+01 -4.90584453e-01 4.43080444e+00 4.74978651e+01
1716.lowfreq: -17.9869 -17.0134 -11.6314 0.0020 0.0021 0.0025 65.4253 100.0168 175.0961
frequency: 65.3199 99.9150 175.0802 190.5357 207.7354 229.9720 311.5203 366.7777 513.7167 581.7786 634.1896 768.3666 870.6413 948.4034 951.7863 975.2487 1032.7153 1120.9380 1178.4433 1253.1428 1289.4371 1332.4012 1383.8246 1448.1485 1451.3847 1466.8515 1473.2836 1485.7883 2988.0534 3006.7017 3015.2220 3068.0013 3090.0603 3100.5087 3136.3982 3143.6242
redmass: 3.6984 3.0131 1.1652 1.5453 1.4983 3.3996 7.4736 2.6711 6.8396 4.4662 7.4454 1.4185 2.0399 1.2975 1.6650 1.4070 2.0864 1.8607 3.6476 1.2111 1.3825 1.1337 1.1938 1.0614 1.0544 1.0425 1.0649 1.0681 1.0344 1.0605 1.0283 1.1000 1.1004 1.1018 1.1032 1.1058
irintensity: 0.2981 1.1237 0.0393 0.0295 0.3850 0.1113 0.2419 1.0453 11.5249 8.9275 0.0176 10.5425 111.3335 9.6160 20.8263 8.2090 18.1097 25.9806 38.8488 21.2668 5.2994 0.2382 11.2462 18.7432 16.7127 9.2253 6.4150 15.8437 29.1094 22.4455 17.3909 1.7233 35.3172 23.5324 7.6780 12.7828
temp: 298.150 k
press: 1.00000 atm
elementType: 16 16 6 6 6 6 1 1 1 1 1 1 1 1
symmnumber: 1
zpe: 289232.6 jmol-1
zpe.correction: 0.110163 hartree
zpe.thermalcorrener: 0.118473 hartree
zpe.thermalcorrenthalpy: 0.119417 hartree
zpe.thermalcorrgfe: 0.076635 hartree
zpe.sumelectzpe: -952.842088 hartree
zpe.sumelectthermal: -952.833778 hartree
zpe.sumelectthermalent: -952.832834 hartree
zpe.sumelectthermalfe: -952.875616 hartree
dipole: -3.4838 2.8808 0.7153
dipole: 4.5768
quadrupole: -50.5770 -53.1104 -52.3838
quadrupole: 1.6994 -0.6684 0.0921
quadrupole: 1.4467 -1.0867 -0.3601 1.6994 -0.6684 0.0921
hfenergy: -952.9522509 hartree
pointgroup: C01 [X(C4H8S2)]
dipole: -0.2693366 1.6185537 0.7417167 debye
dipolederiv: -0.535615 0.3231056 0.0006493 0.1623846 -0.0287042 0.0823896 -0.1722967 0.1801801 0.0449145 -0.4741301 0.2952211 0.0363985 0.3288167 -0.6398736 -0.121838 0.0574859 -0.1954903 -0.1815689 -0.1206872 -0.1135062 -0.107123 -0.1072921 -0.1834277 -0.0885271 -0.0600982 0.00386 0.0954133 0.0768915 0.0152109 0.0381981 0.0128456 0.0667406 0.0231916 -0.0600633 -0.0971825 -0.005794 1.0563409 -0.5845928 0.1309672 -0.5546935 0.7118378 0.2296327 0.235661 0.2759501 -0.0877765 -0.0618984 -0.0012719 -0.0484294 0.0132233 0.0413995 0.0050631 -0.0203088 -0.0328375 0.0437772 -0.0037368 0.0459659 -0.082429 0.0391848 0.0147803 0.0693655 -0.0608831 0.0218716 0.0283694 -0.0106542 0.0223405 0.1260037 0.0194189 0.0120222 -0.0864353 0.075226 -0.0740185 -0.0217956 0.0103925 0.0202848 0.0861092 0.0988288 0.0477732 -0.0675312 0.0930923 -0.0194405 0.0132786 -0.0263245 0.1100304 -0.095794 0.0504743 0.0196231 0.0762309 -0.0619958 0.0726929 0.0152162 0.0075145 -0.1208688 -0.0661414 -0.1300382 -0.0514986 -0.081614 -0.0625223 -0.0696859 0.016167 -0.0656814 0.0776259 -0.0519251 0.0825353 0.0602924 -0.0138576 -0.0502546 -0.0122185 0.0930697 0.0391443 -0.1077039 0.0452463 -0.0603575 -0.07928 -0.0130356 0.0417907 -0.0272471 0.0599027 0.1084439 0.0181585 -0.0117306 0.0446689 0.0083149 -0.0130346 0.0451671 -0.0264341 -0.1131734 unknown
polarizability: 89.2407164|-23.5632951|92.6253898|-0.5259122|14.6498783|52.9823759 unknown
InChI: InChI=1S/C4H8S2/c1-3-4(5)6-2/h3H2,1-2H3
charge 0 multiplicity 1
14 atoms
S  -1.4936 -0.569288 -0.54676
S  0.884963 -2.406651 -0.605623
C  0.975122 0.035459 0.800688
C  1.697856 1.078638 -0.100391
C  0.206258 -0.969652 -0.036207
C  -1.957228 1.029813 0.357902
H  1.727639 -0.52141 1.38513
H  0.311388 0.556604 1.515374
H  2.395389 0.566255 -0.784768
H  0.98112 1.654877 -0.712614
H  2.272035 1.785866 0.524205
H  -2.950719 1.297408 -0.034645
H  -1.240741 1.831974 0.128983
H  -2.022081 0.853308 1.441826
