program: Gaussian 09
title: 000223579
version: EM64L-G09RevD.01
frameworkgroup: C1[X(C3H7NO2)]
method: RPBEPBE
basis: SDD
operation: Freq
keyword: #pfreq=noraman
keyword: PBEPBE/SDD
title: #p freq=noraman PBEPBE/SDD
converged: YES YES NO NO
title: Mulliken charges:
elementType: O O N C C C H H H H H H H
charge: -0.449703 -0.303864 -0.355497 -0.362820 0.215094 -0.601458 0.217978 0.218058 0.311374 0.232297 0.279559 0.231876 0.367107
chargesum: 0.00000
title: Mulliken charges with hydrogens summed into heavy atoms:
elementType: O O N C C C
charge: -0.082596 -0.303864 -0.044123 0.073216 0.215094 0.142273
polarizability: 5.92359314e+01 -3.81811733e+00 4.86786437e+01 2.07832807e-02 2.15108123e-03 3.05360663e+01
1716.lowfreq: -9.4203 -8.1295 0.0005 0.0006 0.0010 9.3345 59.1707 98.1414 164.1760
frequency: 59.1244 98.1062 164.1752 211.5870 335.4407 436.5412 454.8239 548.8802 595.9425 665.4119 863.9963 1000.4106 1015.9210 1070.9156 1123.0067 1136.9331 1184.6340 1240.5034 1260.8393 1396.7329 1423.5835 1463.7586 1472.5859 1485.8749 1527.8105 1629.2992 2955.6072 2986.1367 2995.7181 3067.9445 3118.1294 3382.7478 3549.2102
redmass: 3.2574 1.0883 2.6809 3.7628 5.4773 4.6883 1.1900 1.6814 1.4394 4.2339 3.4848 6.4876 1.9083 4.3100 1.2903 1.6012 1.0707 1.6525 1.5313 1.3366 1.1566 1.1974 1.0713 1.0447 1.6305 6.2452 1.0563 1.0348 1.1049 1.1029 1.0988 1.0642 1.0775
irintensity: 3.0667 0.1227 5.4493 1.8845 45.5444 0.9135 73.4511 177.8102 18.1945 8.8528 4.4457 88.7199 0.9071 23.4968 0.0202 61.5517 4.4063 14.3685 114.9153 162.4848 19.5149 37.1742 1.3098 17.9083 86.6839 162.6238 56.4071 55.1349 41.7281 34.8585 1.9897 54.6364 22.3576
temp: 298.150 k
press: 1.00000 atm
elementType: 8 8 7 6 6 6 1 1 1 1 1 1 1
symmnumber: 1
zpe: 274676.5 jmol-1
zpe.correction: 0.104619 hartree
zpe.thermalcorrener: 0.111849 hartree
zpe.thermalcorrenthalpy: 0.112793 hartree
zpe.thermalcorrgfe: 0.073122 hartree
zpe.sumelectzpe: -323.221907 hartree
zpe.sumelectthermal: -323.214677 hartree
zpe.sumelectthermalent: -323.213733 hartree
zpe.sumelectthermalfe: -323.253404 hartree
dipole: 4.1733 -3.2494 -0.0086
dipole: 5.2891
quadrupole: -39.6110 -34.7574 -36.5462
quadrupole: -2.2587 0.0216 -0.0058
quadrupole: -2.6395 2.2141 0.4253 -2.2587 0.0216 -0.0058
hfenergy: -323.3265257 hartree
pointgroup: C01 [X(C3H7N1O2)]
dipole: -1.6446646 -1.2487326 0.2567002 debye
dipolederiv: -0.6247312 -0.2314628 0.0332923 -0.1093289 -0.4462809 -0.0046262 0.0173267 0.0021369 -0.5477421 -0.7300664 0.0071852 0.0200022 -0.3487689 -0.9748992 0.0966517 0.0645681 0.0761199 -0.3790408 -1.1115409 -0.2693407 0.0682359 -0.2148936 -0.4035643 0.001248 0.0636258 0.0047364 -0.5001148 0.1642923 0.3115243 -0.0245152 0.3997371 0.2646028 -0.0028293 -0.0356579 0.0027368 0.4360595 1.2580022 0.2463683 -0.093148 0.5338871 1.1091972 -0.1499384 -0.1291593 -0.1330949 0.1855542 0.4123782 -0.043799 -0.001551 -0.2486759 0.0253435 0.0436919 0.0226203 0.0312534 0.2658089 0.0096603 -0.0343563 0.0340371 -0.0360606 -0.0116649 0.0937214 0.0289544 0.1410202 -0.1129481 0.0033186 -0.060025 -0.0317291 -0.0550162 -0.0735926 -0.0971536 -0.0268824 -0.1442365 -0.0424003 0.1287283 0.0439536 0.0076587 0.0696492 0.1093347 0.0262578 0.0042074 0.0273992 0.348962 -0.0838867 -0.0191953 -0.0779531 -0.0241011 0.0890691 -0.0925175 -0.1361901 -0.0716819 -0.0411022 0.1498342 -0.0699417 0.0068946 0.0437514 -0.0119467 0.0142979 -0.006618 0.0211788 0.1338692 -0.0591804 0.0055568 0.0800011 0.0152939 0.1193609 0.0523561 0.1367097 0.0319083 -0.0944425 0.4831916 0.1135326 -0.0212253 -0.0254735 0.2050406 0.0188402 -0.0035049 0.0105234 0.3475369 unknown
polarizability: 59.1764412|3.5300633|48.3084759|-2.0944249|-2.447666|30.9657243 unknown
InChI: InChI=1S/C3H7NO2/c1-4-3(6)2-5/h4-5H,2H2,1H3
charge 0 multiplicity 1
13 atoms
O  2.44855 -0.028167 -0.259835
O  0.098192 1.235779 -0.279195
N  -1.184644 -0.691934 0.036909
C  1.292417 -0.878168 -0.081624
C  0.006549 -0.023027 -0.115674
C  -2.48595 -0.007278 0.027136
H  1.357879 -1.407905 0.891697
H  1.253459 -1.637526 -0.890109
H  -1.166021 -1.705673 0.162338
H  -3.119489 -0.365821 -0.804522
H  -2.294926 1.068574 -0.108994
H  -3.02236 -0.157903 0.981576
H  2.091444 0.903748 -0.353304
