program: Gaussian 09
title: 000223566
version: EM64L-G09RevD.01
frameworkgroup: C1[X(C15H16N4O3)]
method: RPBEPBE
basis: SDD
operation: Freq
keyword: #p
keyword: freq=noraman
keyword: PBEPBE/SDD
title: #p freq=noraman PBEPBE/SDD
converged: NO YES NO NO
title: Mulliken charges:
elementType: O O O N N N N C C C C C C C C C C C C C C C H H H H H H H H H H H H H H H H
charge: -0.243398 -0.279375 -0.273802 -0.200619 -0.156737 -0.224261 -0.119650 0.123930 0.090308 0.166029 0.215412 0.210712 -0.614017 -0.615499 -0.602056 -0.432905 0.473638 -0.386100 -0.386087 -0.225018 -0.225034 -0.228362 0.253142 0.256394 0.256334 0.243558 0.273156 0.243552 0.268225 0.248184 0.248220 0.236396 0.236559 0.236281 0.236254 0.231500 0.231510 0.233624
chargesum: 0.00000
title: Mulliken charges with hydrogens summed into heavy atoms:
elementType: O O O N N N N C C C C C C C C C C C C C C C
charge: -0.243398 -0.279375 -0.273802 -0.200619 -0.156737 -0.224261 -0.119650 0.123930 0.090308 0.166029 0.215412 0.210712 0.151853 0.144767 0.162574 0.040050 0.473638 -0.149819 -0.149833 0.006482 0.006476 0.005263
polarizability: 3.05597267e+02 9.34018459e+00 1.77770769e+02 -7.67639920e-02 2.70036508e-04 1.36040420e+02
1716.lowfreq: -11.6504 -6.8462 -0.0007 -0.0006 0.0008 4.1930 6.0365 16.5819 20.6013
frequency: -4.1283 16.3021 19.6208 41.9285 57.4524 88.3627 96.2599 103.0014 110.6748 125.9675 129.6847 134.9755 198.2615 212.6365 229.8999 246.0038 284.6295 314.3824 315.9756 328.7207 351.8106 373.9069 386.1087 401.8984 413.1254 436.3995 478.8589 510.2603 531.6685 593.6805 616.8407 641.7408 642.1000 682.9878 701.8492 703.1103 719.8276 733.6336 746.0481 770.8484 796.2775 848.4538 853.9006 880.9685 933.4350 949.1336 955.1943 964.6937 978.1603 991.2364 1000.3922 1025.7412 1027.0751 1048.4627 1089.4355 1129.2492 1130.1172 1132.0518 1164.6121 1174.6788 1188.1177 1190.8615 1195.2443 1215.8833 1228.5988 1231.5952 1264.7419 1295.2025 1325.4539 1339.3642 1364.0406 1386.5412 1405.0224 1414.0471 1427.3501 1441.2523 1448.2996 1464.6265 1468.9839 1472.5037 1475.1488 1477.5071 1479.9935 1480.8374 1486.7893 1502.9002 1509.8538 1579.0211 1596.2094 1616.9993 1617.8638 1655.1078 3005.3532 3010.0046 3015.1352 3019.1042 3085.9178 3093.8222 3101.0618 3107.9319 3123.8448 3125.1803 3134.6626 3136.2668 3136.3416 3137.7885 3150.9660 3166.8201
redmass: 3.6489 3.5670 1.3952 5.4988 3.0521 2.3204 1.2140 4.1816 5.6164 1.4371 3.0916 2.6404 5.6465 3.4609 5.3112 6.8682 3.0388 3.5587 3.9500 2.9740 3.9030 8.4470 9.3700 2.7925 8.1041 6.7700 4.5375 4.8000 7.2767 6.0165 6.3430 10.7842 5.2205 11.9435 1.8396 11.3303 7.1551 11.1562 2.7290 2.8972 5.8213 3.7593 1.2472 6.4389 1.5709 1.6058 6.1577 2.8414 1.3937 6.2202 1.3246 2.2553 2.6211 3.1342 1.5133 1.3020 1.3049 1.2982 2.5241 1.0547 1.1174 3.5257 1.0839 4.6344 2.8590 2.4434 6.7978 6.6130 1.2755 1.4856 5.2044 8.7302 2.1986 1.3504 1.2517 2.1877 2.4456 1.6081 1.0401 1.1474 1.0436 1.0909 1.0427 1.1709 2.2129 2.4567 2.2094 7.9881 6.1205 7.7842 7.9773 10.7168 1.0336 1.0328 1.0331 1.0576 1.1085 1.1024 1.1021 1.1024 1.0858 1.0886 1.1027 1.1012 1.1020 1.0918 1.0963 1.1016
irintensity: 0.2631 0.0175 0.0734 0.0106 0.6111 0.0056 0.0615 1.1269 0.5041 1.5877 14.8504 4.5431 11.7198 3.4126 0.6074 0.0358 2.4659 1.5459 0.2361 0.4804 9.8857 0.0268 21.5075 0.0012 4.4624 12.1004 14.0019 10.9905 14.1569 22.5884 0.0902 6.2951 20.5427 1.1939 51.5307 6.8530 18.8164 15.3716 34.9114 32.2792 0.7225 16.4409 0.0001 220.1266 1.3778 1.6894 34.7199 113.5897 0.0141 1.3414 0.0228 1.3744 39.0289 13.3924 7.3705 0.2901 0.4763 0.1069 105.7715 0.0010 1.3662 42.2549 1.6882 17.1926 4.0653 22.2663 51.5848 20.2552 0.2710 340.2182 16.1254 0.8023 80.2306 15.4921 70.3494 9.7150 629.4132 15.0226 14.4292 1.6430 17.2047 21.7971 16.7657 18.8451 1.0956 200.8568 176.8574 54.1884 0.7583 227.8874 266.4912 520.3948 38.0404 33.3103 23.3399 19.0838 10.4139 19.3209 18.6921 11.9880 5.6759 2.7338 3.1220 0.5982 0.7003 12.4820 35.3730 21.8456
temp: 298.150 k
press: 1.00000 atm
elementType: 8 8 8 7 7 7 7 6 6 6 6 6 6 6 6 6 6 6 6 6 6 6 1 1 1 1 1 1 1 1 1 1 1 1 1 1 1 1
symmnumber: 1
zpe: 773749.9 jmol-1
zpe.correction: 0.294706 hartree
zpe.thermalcorrener: 0.314661 hartree
zpe.thermalcorrenthalpy: 0.315605 hartree
zpe.thermalcorrgfe: 0.243683 hartree
zpe.sumelectzpe: -1024.317134 hartree
zpe.sumelectthermal: -1024.297179 hartree
zpe.sumelectthermalent: -1024.296235 hartree
zpe.sumelectthermalfe: -1024.368156 hartree
dipole: 6.0343 -0.4995 -0.0035
dipole: 6.0549
quadrupole: -129.5229 -133.4115 -120.6242
quadrupole: 0.3910 0.0152 -0.0061
quadrupole: -1.6701 -5.5586 7.2287 0.3910 0.0152 -0.0061
hfenergy: -1024.6118393 hartree
pointgroup: C01 [X(C15H16N4O3)]
dipole: -2.3750559 0.1841376 -0.0016449 debye
polarizability: 305.4963305|10.0066661|177.8700848|-0.0486806|-0.263132|136.0420409 unknown
InChI: InChI=1S/C15H16N4O3/c1-17-11-12(18(2)15(21)19(3)13(11)20)16-14(17)22-9-10-7-5-4-6-8-10/h4-8H,9H2,1-3H3
charge 0 multiplicity 1
38 atoms
O  -1.615231 -0.366875 -0.001503
O  3.405918 -2.626347 0.017265
O  5.139548 1.765773 -0.009539
N  0.583302 -1.263797 0.005863
N  2.803134 1.532239 -0.010532
N  4.247698 -0.402269 0.00381
N  0.383336 1.026891 -0.009334
C  1.893737 -0.729358 0.00349
C  1.724585 0.663801 -0.005795
C  3.173905 -1.376408 0.008974
C  -0.263479 -0.171597 -0.002013
C  4.123322 1.012352 -0.005696
C  0.198944 -2.682585 0.014677
C  2.595054 2.991822 -0.020423
C  5.636387 -0.91614 0.008667
C  -2.438768 0.901331 -0.010054
C  -3.888832 0.496407 -0.002696
C  -4.584377 0.293603 -1.221416
C  -4.576985 0.313081 1.223284
C  -5.943416 -0.090686 -1.216186
C  -5.935981 -0.071218 1.232512
C  -6.62156 -0.274017 0.011766
H  -0.900015 -2.740899 0.012939
H  0.604442 -3.192578 -0.873855
H  0.600898 -3.180702 0.911536
H  2.029073 3.289108 -0.91932
H  3.586808 3.467065 -0.021976
H  2.026226 3.300814 0.872707
H  5.577291 -2.014376 0.014906
H  6.17279 -0.552001 0.900273
H  6.175225 -0.562208 -0.885563
H  -2.155562 1.470694 -0.91259
H  -2.15091 1.485782 0.881294
H  -4.058934 0.43545 -2.173645
H  -4.045754 0.470112 2.169912
H  -6.472671 -0.24377 -2.163047
H  -6.459433 -0.209167 2.184906
H  -7.676716 -0.569628 0.017298
