program: Gaussian 09
title: 000223570
version: EM64L-G09RevD.01
frameworkgroup: C1[X(C16H18N4O3)]
method: RPBEPBE
basis: SDD
operation: Freq
keyword: #p
keyword: freq=noraman
keyword: PBEPBE/SDD
title: #p freq=noraman PBEPBE/SDD
converged: YES YES NO NO
title: Mulliken charges:
elementType: O O O N N N N C C C C C C C C C C C C C C C C H H H H H H H H H H H H H H H H H H
charge: -0.243876 -0.290061 -0.272993 -0.209021 -0.158211 -0.220782 -0.112432 0.131632 0.092086 0.219213 0.161954 0.210745 -0.635442 -0.251922 -0.615613 -0.584006 -0.601110 0.484030 -0.411799 -0.372479 -0.223471 -0.231242 -0.240042 0.246874 0.295821 0.240722 0.235646 0.242178 0.273168 0.243742 0.244330 0.229993 0.211649 0.268501 0.248434 0.248987 0.228966 0.233142 0.226439 0.226368 0.229882
chargesum: 0.00000
title: Mulliken charges with hydrogens summed into heavy atoms:
elementType: O O O N N N N C C C C C C C C C C C C C C C C
charge: -0.243876 -0.290061 -0.272993 -0.209021 -0.158211 -0.220782 -0.112432 0.131632 0.092086 0.219213 0.161954 0.210745 0.147975 0.225902 0.145626 -0.142364 0.164812 0.484030 -0.182833 -0.139337 0.002968 -0.004874 -0.010160
polarizability: 2.64223142e+02 1.02041485e+00 2.23780836e+02 -1.18977564e+00 -2.01439126e+00 1.44103281e+02
1716.lowfreq: -7.5947 -3.8782 -2.4982 -0.0004 0.0002 0.0005 10.6498 13.4819 21.2497
frequency: 10.1824 13.1452 21.0845 54.1400 78.8285 80.9126 103.0230 105.1054 112.0394 117.5024 132.3498 136.6467 161.3327 192.7921 213.7650 232.7747 249.6629 276.0449 297.3816 321.4666 337.1933 347.4801 367.4076 369.0899 388.8264 402.9628 422.5148 451.6589 491.0541 496.1476 553.4904 581.0830 617.5708 628.4038 642.1473 685.4634 702.8362 704.2487 722.2247 733.0584 749.8275 755.7218 767.3667 795.6970 853.2428 865.1092 913.8227 951.8427 956.8361 964.5397 975.8781 987.2322 992.9805 995.4075 1027.7582 1031.0556 1050.3210 1055.1444 1091.5382 1129.9823 1131.3186 1132.7063 1165.5137 1172.8115 1185.1647 1188.2467 1196.5604 1215.3287 1217.3639 1228.4439 1232.7514 1265.2096 1298.0864 1326.8947 1337.1324 1347.3540 1366.7271 1383.3563 1398.0381 1413.0653 1427.3401 1440.9981 1446.4754 1457.7145 1463.4554 1470.6860 1474.1602 1477.5357 1481.0478 1483.3723 1485.2013 1485.8046 1503.0817 1508.2460 1578.3487 1594.5854 1615.3968 1616.4094 1650.9741 2997.3172 2998.4101 3005.3893 3009.6850 3011.0905 3055.7800 3082.2129 3090.3491 3094.0548 3102.5745 3112.9636 3122.9173 3123.3471 3135.9199 3137.2237 3137.5483 3146.6532 3164.0296
redmass: 5.0634 4.2822 4.7463 4.6570 2.4168 4.5322 4.2784 1.3036 1.0771 1.2563 2.8343 3.9522 3.3056 3.3136 3.8322 5.1753 7.2554 3.3649 3.2295 6.8214 2.7383 3.2417 2.8913 8.3698 8.9928 2.8112 7.2746 6.1312 4.2312 5.5619 4.6370 4.0274 6.2083 4.8868 10.6488 11.4135 11.0003 1.7708 7.1585 11.2178 4.6153 2.9882 1.9655 4.8337 1.2545 3.9234 1.4370 2.7237 5.4998 2.4146 1.4017 3.0125 3.1430 1.3988 2.1135 2.5990 3.0904 2.3199 1.6362 1.3016 1.2975 1.2977 2.5520 1.0609 1.2050 1.1179 3.1949 2.5922 3.7207 2.7440 1.2023 6.3370 6.4434 1.2979 1.4954 1.4044 5.6869 7.5907 2.0988 1.3028 1.2636 2.1533 2.2369 1.1197 1.4553 1.1914 1.0454 1.0731 1.0447 1.0905 2.2665 1.1564 2.3476 2.6029 7.5631 6.0575 6.1873 10.8233 9.9494 1.0599 1.0333 1.0337 1.0584 1.0329 1.1009 1.1083 1.1025 1.1025 1.1021 1.0878 1.1027 1.0862 1.0912 1.1023 1.1010 1.0962 1.1016
irintensity: 0.1654 0.0619 0.1067 0.0221 0.7353 0.5312 0.1969 1.2057 0.2602 0.0050 10.0116 7.6946 5.8465 1.6805 14.8164 1.4674 0.0441 1.6023 0.3959 0.0878 2.6991 8.3701 2.5820 0.0759 24.1296 0.0365 1.0218 12.1784 18.3856 21.3021 6.5353 18.2864 0.2245 5.3087 6.3589 1.6224 6.2916 59.7430 21.3709 15.9816 0.7413 16.3119 29.3300 0.6269 0.6215 49.3340 2.2778 20.9040 24.7771 37.9105 0.2931 57.2498 21.9924 1.8366 6.5172 63.9101 9.4751 50.1584 8.0028 0.3913 0.2500 0.1566 108.6541 1.5024 9.4537 0.3609 12.8209 3.1996 21.0174 2.8400 5.5549 46.7991 24.3411 9.6949 3.6474 203.9469 29.5381 1.9373 31.8541 1.4086 68.1077 7.3263 617.3912 10.6420 2.5924 28.4567 14.3486 8.2084 16.7626 37.5773 20.3412 29.6471 47.4050 354.8407 66.7080 1.1412 4.5527 497.3913 451.2372 14.9218 43.5292 31.8578 36.3835 29.5249 12.5502 28.6804 18.7630 19.6475 18.5334 9.8762 0.3564 2.4489 14.4693 0.7981 0.4546 43.6543 18.6708
temp: 298.150 k
press: 1.00000 atm
elementType: 8 8 8 7 7 7 7 6 6 6 6 6 6 6 6 6 6 6 6 6 6 6 6 1 1 1 1 1 1 1 1 1 1 1 1 1 1 1 1 1 1
symmnumber: 1
zpe: 848491.6 jmol-1
zpe.correction: 0.323173 hartree
zpe.thermalcorrener: 0.345081 hartree
zpe.thermalcorrenthalpy: 0.346025 hartree
zpe.thermalcorrgfe: 0.268590 hartree
zpe.sumelectzpe: -1063.542084 hartree
zpe.sumelectthermal: -1063.520177 hartree
zpe.sumelectthermalent: -1063.519233 hartree
zpe.sumelectthermalfe: -1063.596668 hartree
dipole: -5.0349 -1.3351 -1.1050
dipole: 5.3248
quadrupole: -148.7822 -130.1850 -130.0822
quadrupole: 2.1063 -4.7816 1.6315
quadrupole: -12.4324 6.1648 6.2676 2.1063 -4.7816 1.6315
hfenergy: -1063.8652579 hartree
pointgroup: C01 [X(C16H18N4O3)]
dipole: 1.968971 -0.5661711 0.437406 debye
polarizability: 264.2100639|-1.4035534|223.2926893|0.8745956|6.6332538|144.6045054 unknown
InChI: InChI=1S/C16H18N4O3/c1-18-12-13(19(2)16(22)20(3)14(12)21)17-15(18)23-10-9-11-7-5-4-6-8-11/h4-8H,9-10H2,1-3H3
charge 0 multiplicity 1
41 atoms
O  1.352768 -0.244599 1.090541
O  -3.175555 2.743094 0.207626
O  -5.337094 -1.279697 -0.98693
N  -0.63996 0.968738 0.688607
N  -3.07969 -1.41789 -0.357857
N  -4.235581 0.702225 -0.388267
N  -0.709297 -1.304035 0.340341
C  -1.951489 0.650654 0.266057
C  -1.948486 -0.738707 0.065255
C  0.042834 -0.231997 0.712423
C  -3.101416 1.481438 0.051063
C  -4.279361 -0.703096 -0.600868
C  -0.105488 2.297773 1.0257
C  2.031277 -1.574394 1.012184
C  -3.048373 -2.879173 -0.555528
C  3.495021 -1.353474 1.416809
C  -5.502108 1.422455 -0.652725
C  4.291304 -0.528511 0.414337
C  4.967564 -1.158526 -0.661812
C  4.352928 0.884269 0.520682
C  5.684475 -0.396915 -1.612527
C  5.070341 1.649568 -0.426092
C  5.738277 1.011323 -1.497087
H  0.774278 2.521643 0.398959
H  -0.899793 3.036629 0.839928
H  0.193066 2.333894 2.087463
H  1.510463 -2.264145 1.701058
H  1.931763 -1.954953 -0.020067
H  -4.052029 -3.190664 -0.879295
H  -2.778054 -3.383059 0.387659
H  -2.301571 -3.142624 -1.323369
H  3.510738 -0.879118 2.415437
H  3.948155 -2.357681 1.527831
H  -5.316394 2.489312 -0.460735
H  -6.29899 1.043245 0.007918
H  -5.815872 1.264509 -1.697449
H  4.939227 -2.252092 -0.753282
H  3.83233 1.382657 1.346812
H  6.204062 -0.899957 -2.435916
H  5.111025 2.74041 -0.328168
H  6.296806 1.603673 -2.23042
