program: Gaussian 09
title: 000223564
version: EM64L-G09RevD.01
frameworkgroup: C1[X(C15H12ClN)]
method: RPBEPBE
basis: SDD
operation: Freq
keyword: #p
keyword: freq=noraman
keyword: PBEPBE/SDD
title: #p freq=noraman PBEPBE/SDD
converged: YES YES NO NO
title: Mulliken charges:
elementType: Cl N C C C C C C C C C C C C C C C H H H H H H H H H H H H
charge: -0.049365 -0.017204 -0.257163 -0.620685 0.520498 0.506023 -0.416519 -0.373382 -0.368258 -0.411253 -0.197583 -0.211072 -0.210278 -0.231843 -0.226109 -0.113932 -0.236277 0.267838 0.243482 0.236690 0.239361 0.258642 0.238120 0.227135 0.257655 0.258404 0.229886 0.226237 0.230950
chargesum: 0.00000
title: Mulliken charges with hydrogens summed into heavy atoms:
elementType: Cl N C C C C C C C C C C C C C C C
charge: -0.049365 -0.017204 0.010674 -0.140514 0.520498 0.506023 -0.177158 -0.114740 -0.130138 -0.184117 -0.197583 0.046583 0.048126 -0.001956 0.000129 -0.113932 -0.005327
polarizability: 2.54166323e+02 9.90686188e+00 1.60909689e+02 1.53350320e+01 -2.06647612e+01 9.12864175e+01
1716.lowfreq: -9.5835 -2.4776 -0.0012 -0.0012 0.0007 5.3166 20.2311 28.9416 41.0269
frequency: 19.9762 28.9083 41.0094 51.9939 84.6143 119.1161 146.4336 160.4387 238.8210 250.5397 331.5891 334.8551 351.1334 364.0336 403.1099 408.0294 474.4013 495.5442 507.6605 567.5932 573.6150 617.9999 625.5434 681.4514 705.0455 715.6453 750.6345 790.5405 816.8320 831.1236 836.8809 852.8969 868.3237 921.7684 950.7478 969.8584 976.0282 977.7167 990.6100 996.7360 1001.2360 1013.4998 1027.1383 1074.2357 1083.4860 1111.8155 1157.0132 1174.0219 1188.5958 1189.3278 1196.9570 1217.5944 1239.3718 1294.8919 1301.7723 1315.3465 1330.3107 1378.2838 1383.7283 1399.8087 1441.7364 1474.7269 1478.9052 1484.6726 1588.1439 1594.0621 1601.4961 1614.6812 2194.2034 2997.5966 3007.7537 3068.8089 3110.2380 3125.3070 3126.1625 3135.5047 3140.5187 3148.0243 3165.3004 3169.7472 3173.2627
redmass: 4.2713 4.5118 7.2946 4.4535 7.0370 8.8343 6.4974 7.0188 5.9631 6.5272 5.2447 2.7993 4.0046 8.8187 2.8065 2.8939 3.9867 4.7521 4.8685 4.4006 3.5421 6.2166 7.1110 6.2256 1.7734 3.7948 1.9717 4.5130 2.1760 1.4055 1.6011 1.2565 2.8351 1.5134 1.4062 1.4136 1.4813 2.0263 5.9266 1.3435 4.2360 3.9936 2.2022 2.7398 1.5764 1.3599 1.1520 1.0524 1.1247 1.1202 2.3217 2.5322 1.3570 1.2793 1.3115 1.5730 1.2734 6.6765 7.5587 2.6282 2.1777 1.2678 1.9029 2.2640 7.4372 6.0382 6.1834 6.1471 12.5652 1.0788 1.0634 1.1038 1.0882 1.0863 1.0901 1.0910 1.0900 1.0959 1.1015 1.0951 1.0962
irintensity: 0.0181 0.1590 0.0521 2.0250 1.6937 3.0978 0.3222 0.8266 0.7992 1.2163 1.5308 0.4243 1.4668 6.6010 0.0038 0.1205 3.9227 20.0897 11.3864 15.4191 22.4996 0.1670 0.5498 8.4865 53.8402 7.0858 26.8113 5.1694 44.8349 8.1289 19.8427 0.3528 6.5514 1.7194 0.0968 0.0265 0.2986 0.4166 0.5540 0.3684 46.0587 1.9097 6.0006 44.0207 14.4993 5.5620 4.3931 0.1535 0.3090 0.1855 0.1944 0.8144 6.6568 3.9081 0.1179 1.1185 0.8768 0.1763 0.0848 7.4459 7.7126 12.4552 90.3667 16.3730 1.3375 1.7332 5.5501 5.4253 6.1845 0.9294 28.4513 8.3665 12.2225 2.3042 11.3036 12.2199 3.2076 35.4158 22.3524 4.1222 0.4818
temp: 298.150 k
press: 1.00000 atm
elementType: 17 7 6 6 6 6 6 6 6 6 6 6 6 6 6 6 6 1 1 1 1 1 1 1 1 1 1 1 1
symmnumber: 1
zpe: 584669.4 jmol-1
zpe.correction: 0.222689 hartree
zpe.thermalcorrener: 0.237673 hartree
zpe.thermalcorrenthalpy: 0.238617 hartree
zpe.thermalcorrgfe: 0.177458 hartree
zpe.sumelectzpe: -1092.414677 hartree
zpe.sumelectthermal: -1092.399693 hartree
zpe.sumelectthermalent: -1092.398749 hartree
zpe.sumelectthermalfe: -1092.459908 hartree
dipole: 1.1370 -3.2023 -0.6618
dipole: 3.4620
quadrupole: -108.8167 -107.6631 -109.1812
quadrupole: -5.4499 -0.7865 -11.2202
quadrupole: -0.2631 0.8906 -0.6275 -5.4499 -0.7865 -11.2202
hfenergy: -1092.6373661 hartree
pointgroup: C01 [X(C15H12Cl1N1)]
dipole: -0.4635651 1.2213892 0.3853565 debye
polarizability: 252.5784399|20.2361691|128.6967042|-13.9190902|39.5873374|125.0872853 unknown
InChI: InChI=1S/C15H12ClN/c16-15-8-6-13(7-9-15)14(11-17)10-12-4-2-1-3-5-12/h1-9,14H,10H2
charge 0 multiplicity 1
29 atoms
Cl 6.053343 0.774136 -0.381592
N  -0.677942 -2.893898 -0.478118
C  0.039933 -0.442027 0.295882
C  -0.788714 0.642007 -0.504378
C  1.547336 -0.201848 0.140111
C  -2.282782 0.581917 -0.231116
C  2.186628 0.729674 0.995255
C  2.306459 -0.834459 -0.87417
C  -3.142139 -0.208671 -1.036276
C  -2.840676 1.300232 0.858275
C  -0.353857 -1.802733 -0.121143
C  3.557138 1.03376 0.845284
C  3.678725 -0.542838 -1.039111
C  -4.525512 -0.28089 -0.758784
C  -4.223289 1.229874 1.139485
C  4.282884 0.391434 -0.176732
C  -5.070461 0.437343 0.330449
H  -0.233149 -0.335281 1.364708
H  -0.572206 0.509254 -1.579965
H  -0.379185 1.624983 -0.206851
H  1.617354 1.220667 1.794023
H  1.834845 -1.572433 -1.532709
H  -2.726836 -0.772902 -1.87987
H  -2.190977 1.927736 1.482537
H  4.049593 1.749031 1.510165
H  4.265156 -1.03606 -1.819452
H  -5.175728 -0.896631 -1.38995
H  -4.639916 1.794439 1.981227
H  -6.143524 0.382684 0.545015
