program: Gaussian 09
title: 000223562
version: EM64L-G09RevD.01
frameworkgroup: C1[X(C14H22)]
method: RPBEPBE
basis: SDD
operation: Freq
keyword: #p
keyword: freq=noraman
keyword: PBEPBE/SDD
title: #p freq=noraman PBEPBE/SDD
converged: YES YES NO NO
title: Mulliken charges:
elementType: C C C C C C C C C C C C C C H H H H H H H H H H H H H H H H H H H H H H
charge: 0.183045 -0.003566 -0.068047 0.460526 -0.757539 -0.810938 -0.796285 -0.733901 -0.736899 -0.392443 -0.419320 -0.265853 -0.247555 -0.245888 0.187445 0.224647 0.225987 0.220362 0.211294 0.218558 0.224539 0.217197 0.221402 0.230099 0.213459 0.215113 0.234116 0.209832 0.223363 0.212720 0.204455 0.223126 0.246984 0.222133 0.221280 0.226549
chargesum: 0.00000
title: Mulliken charges with hydrogens summed into heavy atoms:
elementType: C C C C C C C C C C C C C C
charge: 0.183045 0.183879 0.156600 0.460526 -0.099896 -0.150643 -0.131324 -0.074840 -0.096360 -0.169317 -0.172336 -0.043720 -0.026275 -0.019339
polarizability: 1.70730027e+02 1.72982426e+01 1.26407887e+02 -2.00502368e+00 2.56985088e+00 1.40338124e+02
1716.lowfreq: -22.6191 -0.0004 0.0002 0.0005 6.8137 12.3309 37.1145 50.9325 69.3014
frequency: 33.8045 50.8459 69.2784 116.0002 186.4106 194.5404 204.1574 210.4154 242.7764 250.6468 268.8342 278.9568 290.0535 324.1149 333.7962 341.7187 345.9860 381.9111 406.5400 436.2582 465.5812 535.4980 555.7571 592.6890 618.6047 694.6231 704.8590 753.0755 772.9953 818.2368 849.9431 897.2023 907.5079 920.9090 923.7399 935.9265 953.4935 973.9580 987.8943 991.1399 991.8665 1003.1561 1017.0451 1027.9510 1074.5251 1081.4103 1094.7960 1110.8698 1145.2691 1169.9256 1172.9580 1187.8901 1199.6217 1203.4319 1239.7212 1292.4766 1312.7126 1321.6023 1344.2761 1347.6686 1372.8184 1373.9276 1378.5345 1380.0431 1392.5482 1399.7881 1432.5652 1462.4041 1465.6411 1467.3991 1467.8416 1475.9068 1479.2905 1483.8981 1488.8424 1493.2179 1495.5705 1500.4599 1587.1564 1610.9335 2961.7497 2965.3320 2976.2399 2976.4919 2979.8218 2982.0971 2984.1872 3053.8235 3063.2954 3064.8837 3066.1404 3067.5622 3073.5175 3075.3435 3081.2913 3081.6723 3086.3804 3115.5128 3123.1688 3136.9089 3150.6695 3162.7606
redmass: 3.0392 3.6554 2.8587 2.9409 2.0079 2.1972 1.2183 1.2350 1.2528 1.2743 2.1958 2.4636 2.2804 2.6778 1.9407 1.5742 1.8536 2.2901 2.7930 2.9375 2.7850 2.3724 3.0240 2.8216 6.3559 3.4563 1.6173 2.6590 2.0280 2.5034 1.2485 1.7390 1.3740 1.5786 1.4946 1.5059 1.4124 1.3892 2.1250 2.0110 1.5455 1.5123 1.6737 2.5644 1.7003 1.6802 1.9710 2.0385 2.3070 2.5352 1.0692 2.1452 1.2521 2.2144 2.9258 1.2819 1.3344 1.3826 1.4079 1.3790 1.2046 2.5659 1.5958 1.2334 1.2190 1.1976 2.2187 1.0616 1.0648 1.0649 1.0463 1.0532 1.0563 1.7038 1.1118 1.0732 1.0615 1.0613 5.8336 6.0283 1.0403 1.0753 1.0363 1.0359 1.0405 1.0738 1.0410 1.0992 1.0987 1.0996 1.0989 1.0992 1.0995 1.0995 1.0984 1.0982 1.0982 1.0844 1.0871 1.0931 1.0946 1.0998
irintensity: 0.0046 0.0366 0.0073 0.1559 0.2636 0.3985 0.0572 0.1886 0.2546 0.4119 0.0955 0.1074 0.0956 0.0617 0.1413 0.2367 0.0666 0.3497 0.0096 0.1454 1.1671 2.2073 12.2151 1.8826 0.0491 0.6378 57.4354 6.3212 39.5233 0.9262 0.0630 1.6981 2.7551 1.0947 2.5018 0.9505 0.5354 0.0092 1.5233 1.5901 0.7254 2.5679 2.3055 13.3416 12.8624 11.0059 22.5352 5.7027 2.8545 1.5712 0.1705 7.1518 0.3464 0.6119 12.4739 0.1677 6.6394 0.5331 1.8357 0.2727 8.7303 11.2726 10.2567 17.2369 29.7235 22.1160 11.0621 6.2782 5.2417 4.3816 0.9582 9.2535 6.5335 13.6240 19.0070 4.1339 15.3913 10.3007 1.5388 9.7885 21.1641 45.9786 0.7509 44.6900 42.3778 7.9700 25.8306 11.5668 55.5679 37.0836 41.7813 15.5329 30.3951 93.5945 47.9750 28.5325 34.0233 7.0924 1.5886 35.0506 37.5716 16.0698
temp: 298.150 k
press: 1.00000 atm
elementType: 6 6 6 6 6 6 6 6 6 6 6 6 6 6 1 1 1 1 1 1 1 1 1 1 1 1 1 1 1 1 1 1 1 1 1 1
symmnumber: 1
zpe: 840959.7 jmol-1
zpe.correction: 0.320305 hartree
zpe.thermalcorrener: 0.335774 hartree
zpe.thermalcorrenthalpy: 0.336718 hartree
zpe.thermalcorrgfe: 0.278690 hartree
zpe.sumelectzpe: -545.589328 hartree
zpe.sumelectthermal: -545.573859 hartree
zpe.sumelectthermalent: -545.572915 hartree
zpe.sumelectthermalfe: -545.630943 hartree
dipole: 0.2298 0.1352 -0.0323
dipole: 0.2686
quadrupole: -86.9025 -90.2679 -84.0751
quadrupole: 3.0904 -0.5861 0.6771
quadrupole: 0.1793 -3.1861 3.0067 3.0904 -0.5861 0.6771
hfenergy: -545.9096326 hartree
pointgroup: C01 [X(C14H22)]
dipole: 0.088862 0.0571488 0.0009646 debye
polarizability: 169.3547345|18.6607272|127.200247|2.382518|2.7129897|140.9210565 unknown
InChI: InChI=1S/C14H22/c1-11(2)12(3)14(4,5)13-9-7-6-8-10-13/h6-12H,1-5H3
charge 0 multiplicity 1
36 atoms
C  0.463052 1.129853 0.180673
C  1.621616 0.229603 -0.432092
C  1.772313 -1.170821 0.272381
C  -0.890951 0.39128 -0.004997
C  0.37431 2.481741 -0.596805
C  0.728664 1.470987 1.669467
C  2.975876 0.96717 -0.572406
C  2.827598 -1.227694 1.408184
C  2.091575 -2.264797 -0.778703
C  -1.345945 0.066034 -1.314279
C  -1.730069 0.032334 1.081885
C  -2.576054 -0.590395 -1.52828
C  -2.965853 -0.625291 0.875047
C  -3.396402 -0.943262 -0.431066
H  1.289103 0.007412 -1.468179
H  0.787766 -1.423988 0.715079
H  -0.525688 3.042779 -0.28533
H  1.257002 3.113792 -0.393123
H  0.312296 2.325258 -1.689438
H  1.703574 1.978564 1.77784
H  0.740962 0.574576 2.31287
H  -0.046066 2.158358 2.057811
H  3.363944 1.329823 0.396285
H  2.89605 1.83374 -1.251742
H  3.738032 0.288683 -0.999091
H  3.853017 -1.111128 1.010376
H  2.675336 -0.448992 2.175197
H  2.780357 -2.211002 1.913676
H  1.278546 -2.349212 -1.523682
H  2.217968 -3.253723 -0.298828
H  3.02977 -2.034997 -1.321003
H  -0.735835 0.334125 -2.185064
H  -1.428614 0.266989 2.107203
H  -2.896269 -0.825004 -2.550215
H  -3.589981 -0.888176 1.737294
H  -4.352797 -1.45292 -0.593545
