program: Gaussian 09
title: 000223574
version: EM64L-G09RevD.01
frameworkgroup: C1[X(C20H26O3S)]
method: RPBEPBE
basis: SDD
operation: Freq
keyword: #p
keyword: freq=noraman
keyword: PBEPBE/SDD
title: #p freq=noraman PBEPBE/SDD
converged: YES YES NO NO
title: Mulliken charges:
elementType: S O O O C C C C C C C C C C C C C C C C C C C C H H H H H H H H H H H H H H H H H H H H H H H H H H
charge: 0.947389 -0.386981 -0.504194 -0.504750 0.137774 0.299571 -0.413008 0.510779 -0.713770 -0.778412 -0.730084 -0.727538 -0.718804 -0.380833 -0.376270 -0.375834 -0.361639 0.306847 -0.038958 -0.248274 -0.241300 -0.198902 -0.199417 -0.215267 0.192867 0.192187 0.218616 0.229082 0.211455 0.217907 0.222759 0.214056 0.212082 0.211615 0.212312 0.205954 0.207696 0.231781 0.203984 0.225830 0.219438 0.232075 0.254853 0.251522 0.251549 0.284804 0.282417 0.243147 0.242996 0.238888
chargesum: 0.00000
title: Mulliken charges with hydrogens summed into heavy atoms:
elementType: S O O O C C C C C C C C C C C C C C C C C C C C
charge: 0.947389 -0.386981 -0.504194 -0.504750 0.137774 0.299571 -0.027953 0.510779 -0.054616 -0.123690 -0.094075 -0.082106 -0.069552 -0.148758 -0.121418 -0.124312 -0.110090 0.306847 -0.038958 0.036531 0.041117 0.044245 0.043579 0.023621
polarizability: 4.77232441e+02 2.88487207e+01 1.98868331e+02 -3.27134821e+00 8.83281097e+00 2.26472334e+02
1716.lowfreq: -13.6292 -7.6564 -2.3708 -0.0021 -0.0016 -0.0010 8.8159 14.3013 19.2894
frequency: -10.9558 13.5310 19.2789 33.5620 36.5886 46.8699 62.7914 63.7885 119.9387 141.4626 151.7897 168.1184 170.0732 193.1038 195.5813 216.1453 232.1243 235.8835 243.3764 261.5639 269.0030 282.8198 290.1699 305.6134 334.2424 341.7595 357.1049 363.5456 368.5195 376.1359 399.4543 403.2480 408.6099 417.9518 424.9950 450.9094 476.8942 494.5388 502.0432 523.5742 585.7589 601.5397 629.9256 654.2047 661.7838 687.0434 736.2104 749.2862 759.1254 812.0785 817.4097 828.3326 832.2781 848.5757 857.2955 865.3271 906.8883 916.7073 928.5927 934.2126 934.4695 935.0123 939.3700 966.6357 972.6156 976.5259 978.1464 984.1416 999.2223 1005.2769 1005.4575 1007.8173 1021.7747 1030.9910 1047.1647 1077.9811 1089.5304 1106.5887 1127.8643 1153.3911 1160.2802 1173.8377 1178.6959 1192.2089 1216.0107 1218.4521 1249.9960 1254.8436 1298.1649 1304.3249 1326.0645 1342.8580 1352.2479 1369.4752 1377.2331 1378.2722 1384.5962 1396.9041 1405.4368 1419.1955 1436.9905 1451.4593 1451.9816 1459.0821 1461.7445 1463.6172 1465.4562 1470.8410 1479.1801 1481.3433 1481.7416 1488.4011 1496.7748 1501.5776 1545.8402 1576.5801 1595.4042 1602.8016 2956.1179 2963.1714 2971.4570 2973.2209 2977.0975 2980.9803 3010.5520 3055.6596 3061.0893 3062.1385 3068.3838 3068.8861 3071.4079 3080.3474 3083.0513 3085.0107 3094.6091 3133.2101 3138.8933 3149.5234 3150.9215 3159.8892 3164.9328 3169.2919 3171.4168 3177.3552
redmass: 5.2023 4.5150 5.1232 3.4806 3.7750 5.3439 3.7376 5.9573 4.1017 7.6289 6.1287 3.2378 2.4697 1.7729 2.6240 2.4175 1.1158 1.4665 6.7801 3.0544 2.7512 1.2224 1.7576 3.3070 5.8790 1.5638 2.4921 2.3939 2.1249 4.7298 2.8638 2.8203 2.1852 3.9493 4.0432 4.1888 2.6448 3.6843 3.9302 3.1272 2.3925 6.4813 7.2126 5.6711 5.3736 2.4508 3.4630 3.7954 1.4090 4.0655 8.7878 1.5331 2.2745 1.2435 1.9166 1.9337 2.0531 1.7496 1.5549 1.3471 1.3136 14.7211 1.4779 1.3725 1.5662 6.2884 1.5003 1.3878 2.3590 1.4135 1.3679 4.2221 1.3989 1.4181 2.1166 1.5479 2.0874 1.7121 1.9327 1.8544 1.7038 1.0556 1.1229 2.5714 2.3547 2.1897 3.1091 3.4272 1.3233 1.2972 1.5627 1.4230 3.3805 1.2113 1.2108 1.2053 8.5983 1.2165 1.2151 3.6917 2.2494 1.0788 2.0108 1.0565 1.0511 1.0622 1.1774 1.0619 1.4809 1.1580 1.0938 1.0603 1.0618 1.0561 6.4477 5.8440 5.9529 6.9141 1.0588 1.0354 1.0367 1.0347 1.0378 1.0365 1.0995 1.0995 1.0992 1.0996 1.0989 1.0987 1.0997 1.1000 1.0986 1.0991 1.0957 1.0877 1.0860 1.0873 1.0887 1.0929 1.0956 1.0969 1.0968 1.1015
irintensity: 0.6100 0.9993 1.4794 0.4706 0.1103 1.7411 0.1233 1.8825 14.4495 1.7205 0.1540 3.6180 4.8958 0.2544 12.6227 0.5935 0.0151 1.9259 15.4409 3.5301 8.9448 2.8283 6.4938 21.3465 0.2366 0.0531 2.0763 1.3545 2.4582 13.0642 1.0359 0.0074 1.9898 17.7163 40.9538 63.6120 8.1996 54.8335 37.8031 4.6758 13.0752 0.0014 0.3172 5.3962 1.6260 29.7431 1.0468 2.0344 65.6254 11.3996 58.7137 1.3998 3.3434 0.2704 63.2453 5.6143 3.5472 9.0902 1.7022 1.6721 0.9816 60.6428 3.1406 0.7780 6.1223 12.7001 4.7530 0.0135 2.4593 12.2347 1.8375 2.0388 0.9481 1.7505 26.1497 4.9479 46.4439 9.1275 8.4722 53.8042 5.6040 0.0786 17.0068 1.4459 13.2177 6.1518 20.4486 27.5582 0.2344 3.2684 9.3372 3.5645 3.2588 9.7051 27.1054 19.3411 6.0913 13.8174 14.3417 9.8590 15.9936 3.5474 17.5884 2.0127 0.6723 3.8987 1.9900 12.4347 20.2872 3.3707 17.2605 28.1897 21.3477 22.6121 0.3781 12.8297 173.3669 0.4922 28.0805 42.3991 51.8232 42.0602 18.0013 32.9147 31.3650 4.7013 56.4806 6.3505 23.0163 116.2270 82.8010 36.9272 32.2608 42.7456 41.2895 22.6756 0.9807 8.0410 11.1580 2.3116 8.2858 2.7840 7.8503 36.5988
temp: 298.150 k
press: 1.00000 atm
elementType: 16 8 8 8 6 6 6 6 6 6 6 6 6 6 6 6 6 6 6 6 6 6 6 6 1 1 1 1 1 1 1 1 1 1 1 1 1 1 1 1 1 1 1 1 1 1 1 1 1 1
symmnumber: 1
zpe: 1072199.7 jmol-1
zpe.correction: 0.408379 hartree
zpe.thermalcorrener: 0.433472 hartree
zpe.thermalcorrenthalpy: 0.434416 hartree
zpe.thermalcorrgfe: 0.352050 hartree
zpe.sumelectzpe: -1399.481632 hartree
zpe.sumelectthermal: -1399.456540 hartree
zpe.sumelectthermalent: -1399.455595 hartree
zpe.sumelectthermalfe: -1399.537961 hartree
dipole: -0.2512 3.3702 -0.6977
dipole: 3.4509
quadrupole: -114.6786 -161.1157 -146.0024
quadrupole: 22.2044 -4.3713 3.7473
quadrupole: 25.9203 -20.5168 -5.4035 22.2044 -4.3713 3.7473
hfenergy: -1399.8900116 hartree
pointgroup: C01 [X(C20H26O3S1)]
dipole: -0.0138174 1.3475605 0.1647917 debye
polarizability: 479.2611404|9.5791193|193.8210044|12.6295472|-1.5195493|229.4909615 unknown
InChI: InChI=1S/C20H26O3S/c1-19(2,3)15-20(4,5)16-11-13-17(14-12-16)23-24(21,22)18-9-7-6-8-10-18/h6-14H,15H2,1-5H3
charge 0 multiplicity 1
50 atoms
S  3.056483 -1.397558 0.029442
O  1.764917 0.185556 0.116109
O  3.008024 -2.042696 -1.465072
O  2.865126 -2.345483 1.340089
C  -3.893459 -0.946525 -0.321428
C  -4.994855 1.497345 0.363602
C  -4.749549 -0.031475 0.633985
C  -2.38182 -0.632609 -0.229743
C  -4.08389 -2.415096 0.193606
C  -4.416188 -0.910321 -1.779941
C  -5.486848 2.103128 1.711832
C  -6.118087 1.728262 -0.687321
C  -3.715131 2.256279 -0.073492
C  -1.734181 -0.612073 1.042272
C  -1.575225 -0.419211 -1.382638
C  -0.355968 -0.378113 1.164843
C  -0.192349 -0.180998 -1.281279
C  0.426721 -0.134685 -0.001118
C  4.622782 -0.378288 0.222395
C  5.13378 -0.200481 1.518117
C  5.20855 0.152299 -0.938396
C  6.318124 0.560408 1.651288
C  6.391469 0.910685 -0.781168
C  6.93948 1.115391 0.507471
H  -5.749317 -0.509182 0.712074
H  -4.303642 -0.115593 1.645479
H  -3.806719 -2.513359 1.25862
H  -3.458074 -3.11771 -0.385911
H  -5.141628 -2.720631 0.086499
H  -3.944015 -1.703932 -2.388758
H  -5.506322 -1.087888 -1.789051
H  -4.229105 0.056876 -2.277748
H  -4.698128 2.042622 2.485461
H  -6.37773 1.564996 2.088996
H  -5.760685 3.167714 1.587055
H  -7.050359 1.21074 -0.389949
H  -6.343888 2.808752 -0.768418
H  -5.83645 1.37222 -1.691782
H  -3.932113 3.338155 -0.162289
H  -2.898104 2.131887 0.660165
H  -3.339221 1.908073 -1.051666
H  -2.318227 -0.787127 1.952508
H  -2.029863 -0.440205 -2.376949
H  0.138589 -0.368833 2.141459
H  0.425466 -0.020662 -2.170766
H  4.635171 -0.652413 2.381242
H  4.767812 -0.034151 -1.922522
H  6.750394 0.717907 2.644725
H  6.879938 1.339022 -1.662347
H  7.855614 1.705081 0.620024
