program: Gaussian 09
title: 000223577
version: EM64L-G09RevD.01
frameworkgroup: C1[X(C21H16Cl2O2)]
method: RPBEPBE
basis: SDD
operation: Freq
keyword: #p
keyword: freq=noraman
keyword: PBEPBE/SDD
title: #p freq=noraman PBEPBE/SDD
converged: YES YES NO NO
title: Mulliken charges:
elementType: Cl Cl O O C C C C C C C C C C C C C C C C C C C C C H H H H H H H H H H H H H H H H
charge: -0.063749 -0.040737 -0.333830 -0.213803 0.378948 -0.684222 0.063464 0.617920 0.368175 -0.376222 -0.421547 -0.235296 -0.328212 -0.414128 -0.822183 -0.233003 -0.237902 0.144226 -0.231056 0.250711 -0.327989 -0.328014 -0.212732 -0.199735 -0.098814 0.237749 0.256449 0.244832 0.235395 0.226074 0.242919 0.235639 0.226128 0.266209 0.255018 0.232582 0.235222 0.275665 0.285830 0.262183 0.261836
chargesum: 0.00000
title: Mulliken charges with hydrogens summed into heavy atoms:
elementType: Cl Cl O O C C C C C C C C C C C C C C C C C C C C C
charge: -0.063749 -0.040737 -0.333830 -0.213803 0.378948 -0.190024 0.063464 0.617920 0.368175 -0.131390 -0.186153 -0.009222 -0.328212 -0.171209 -0.094206 0.022015 -0.005320 0.144226 0.004166 0.250711 -0.052324 -0.042184 0.049451 0.062101 -0.098814
polarizability: 3.34996288e+02 1.18824851e+01 2.46212866e+02 1.59017197e+01 9.81752660e+00 1.81882743e+02
1716.lowfreq: -9.7052 -6.4421 0.0014 0.0026 0.0032 1.2965 11.5433 16.2261 27.5816
frequency: 11.2959 15.6357 27.5013 32.4166 43.2786 60.7869 69.1719 90.0006 100.3050 133.5653 152.0088 164.6778 177.4302 209.0356 229.0419 247.0307 257.7596 269.3082 292.8092 304.9752 312.0736 357.3092 390.1673 410.3997 417.9175 439.5965 464.8670 478.7685 493.2885 497.5768 513.9410 531.2238 536.7862 567.1343 611.1740 621.7500 662.7327 665.0239 674.9088 693.7863 727.1524 740.9410 751.3650 765.6942 780.5646 794.0019 819.4681 827.0838 841.3171 852.3227 872.4253 899.1959 919.5594 943.4792 950.2380 980.4882 981.3915 986.5806 988.7463 994.6695 1012.8231 1018.8963 1028.0771 1040.5233 1050.6830 1070.1190 1084.2761 1109.9373 1121.1987 1138.4061 1169.8077 1178.0337 1179.5654 1187.4640 1213.3126 1236.0612 1255.9215 1268.9472 1282.4525 1291.9219 1308.8068 1373.3306 1376.2829 1379.7123 1396.9657 1398.9529 1425.9616 1438.1740 1457.8398 1463.0355 1465.7262 1470.7688 1471.6103 1488.2246 1575.6353 1577.6042 1594.6783 1597.9493 1605.2420 1613.9423 1637.2206 2982.1545 2991.1447 3062.3482 3063.2770 3093.4709 3125.0327 3126.3477 3137.8796 3141.9525 3156.4156 3159.1699 3159.4607 3165.1240 3174.5249 3177.2765 3184.4921
redmass: 8.9047 8.6245 5.2994 6.6000 5.0745 5.7981 5.4920 8.2299 6.1177 4.0147 1.6557 2.5851 5.7950 3.2907 9.0393 4.6298 5.5263 4.2257 5.8817 5.2886 4.1595 4.1846 6.3381 2.9139 4.3227 3.3053 3.9558 3.8984 4.5297 6.0113 3.6150 4.3597 5.9604 5.6870 5.1565 7.1241 6.3951 4.8819 4.8773 5.4040 4.8477 3.8202 2.0098 1.6624 2.3261 2.5296 5.6052 3.5778 1.2440 1.6040 1.5031 1.4439 2.2295 1.9727 1.4541 1.3514 1.3521 1.3279 1.3655 5.7273 1.9501 6.9105 4.2530 2.0784 1.5375 2.8246 2.1689 1.3489 1.6597 3.3691 1.0846 1.1716 1.1400 1.1287 2.3577 3.9146 1.7980 2.6647 1.3747 1.2499 1.5855 7.6560 5.5784 6.1299 3.9991 1.2521 2.1691 2.5648 1.8308 2.0974 1.1081 1.4318 2.3373 1.1923 6.1257 8.1172 5.8089 6.1652 7.2636 7.9396 11.8331 1.0370 1.0646 1.0952 1.0977 1.0991 1.0877 1.0860 1.0917 1.0890 1.0892 1.0967 1.0973 1.0893 1.0997 1.0968 1.0976
irintensity: 0.2852 0.3940 0.1427 0.2674 0.0490 0.2619 0.3706 1.3142 0.7624 1.1267 1.2527 1.0898 0.6309 1.9727 5.6540 1.4435 1.6429 0.8497 0.8780 3.3129 5.1082 3.7056 17.5982 0.0022 3.8623 4.7240 7.0632 6.9514 6.8554 15.0396 0.3312 3.4321 2.2926 4.5246 3.1415 1.6895 10.9331 25.1602 0.4867 7.0355 2.6648 20.7993 50.4567 46.0874 12.2820 38.7048 3.3399 4.8187 0.2318 49.0365 1.3784 1.4287 0.2745 9.0501 2.7845 0.5903 1.1663 0.0676 0.0632 222.7625 1.5166 51.6522 172.4237 6.8115 8.9086 91.4098 141.6379 6.9616 0.8372 264.3665 8.6866 14.0894 23.9762 5.9685 1.8057 348.4943 2.1709 2.2770 2.7741 1.6788 2.3416 1.9363 4.8721 1.1031 16.1928 11.9295 18.2598 16.6892 2.8726 42.0944 28.9877 12.7492 44.9614 43.7107 6.2204 3.5779 23.6389 98.5101 0.3001 6.7346 176.8476 22.7392 15.6247 3.5068 9.5711 24.7497 5.1781 2.2086 16.6000 8.1908 0.0288 13.6934 31.7727 0.5630 15.7554 2.7645 1.6354
temp: 298.150 k
press: 1.00000 atm
elementType: 17 17 8 8 6 6 6 6 6 6 6 6 6 6 6 6 6 6 6 6 6 6 6 6 6 1 1 1 1 1 1 1 1 1 1 1 1 1 1 1 1
symmnumber: 1
zpe: 805094.6 jmol-1
zpe.correction: 0.306644 hartree
zpe.thermalcorrener: 0.329174 hartree
zpe.thermalcorrenthalpy: 0.330118 hartree
zpe.thermalcorrgfe: 0.250493 hartree
zpe.sumelectzpe: -1878.679728 hartree
zpe.sumelectthermal: -1878.657198 hartree
zpe.sumelectthermalent: -1878.656254 hartree
zpe.sumelectthermalfe: -1878.735879 hartree
dipole: 2.2127 -0.6144 0.2196
dipole: 2.3069
quadrupole: -144.3813 -154.2783 -156.3559
quadrupole: -8.2694 3.3631 -4.6042
quadrupole: 7.2905 -2.6064 -4.6841 -8.2694 3.3631 -4.6042
hfenergy: -1878.9863722 hartree
pointgroup: C01 [X(C21H16Cl2O2)]
dipole: -0.883277 0.2079443 0.0185557 debye
polarizability: 335.0810731|15.327341|244.90043|-8.6603132|-15.8222186|183.1103938 unknown
InChI: InChI=1S/C21H16Cl2O2/c1-14-5-4-7-17(13-16-6-2-3-8-19(16)23)20(14)25-21(24)15-9-11-18(22)12-10-15/h2-12H,13H2,1H3
charge 0 multiplicity 1
41 atoms
Cl -1.481611 1.496637 -2.177459
Cl 6.555738 2.571731 -0.227557
O  0.73328 -0.888276 -0.192863
O  1.740603 -2.008578 1.606219
C  -1.648639 -0.980119 0.293258
C  -1.583758 0.463124 0.80121
C  -0.479748 -1.658599 -0.124983
C  -2.736389 1.338087 0.335919
C  -0.474546 -3.000279 -0.57977
C  -2.868777 -1.69796 0.259459
C  -1.716203 -3.6814 -0.590973
C  -2.903321 -3.039541 -0.174529
C  -2.818505 1.859557 -0.978056
C  -3.798388 1.673508 1.217337
C  0.801272 -3.675809 -1.03924
C  -3.886154 2.663323 -1.419797
C  -4.883449 2.477998 0.804992
C  1.786801 -1.132964 0.714362
C  -4.929638 2.97298 -0.517705
C  2.92949 -0.212254 0.452852
C  4.084665 -0.334925 1.268309
C  2.888514 0.76984 -0.571828
C  5.193659 0.509969 1.067087
C  3.992714 1.621039 -0.782096
C  5.128027 1.475885 0.041344
H  -1.577892 0.447431 1.908668
H  -0.623399 0.903966 0.482565
H  -3.792436 -1.193584 0.563831
H  -1.745496 -4.720768 -0.937681
H  -3.854382 -3.582545 -0.197234
H  -3.759867 1.294114 2.245617
H  1.379335 -3.026744 -1.722114
H  0.578498 -4.619243 -1.564839
H  1.453088 -3.908437 -0.176746
H  -3.899474 3.041931 -2.445987
H  -5.685049 2.71855 1.511189
H  -5.764553 3.598424 -0.850717
H  4.097392 -1.096209 2.0549
H  1.995593 0.860036 -1.195898
H  6.087983 0.422958 1.690083
H  3.972822 2.381346 -1.567731
