program: Gaussian 09
title: 000223555
version: EM64L-G09RevD.01
frameworkgroup: C1[X(C14H13ClO)]
method: RPBEPBE
basis: SDD
operation: Freq
keyword: #p
keyword: freq=noraman
keyword: PBEPBE/SDD
title: #p freq=noraman PBEPBE/SDD
converged: NO YES NO NO
title: Mulliken charges:
elementType: Cl O C C C C C C C C C C C C C C H H H H H H H H H H H H H
charge: -0.071290 -0.440913 -0.578322 -0.584856 0.556436 0.536376 -0.527584 -0.438185 -0.379250 -0.416211 0.302585 -0.190416 -0.086534 -0.206867 -0.410563 -0.244004 0.225960 0.225292 0.227930 0.229057 0.254854 0.233891 0.259250 0.238680 0.223619 0.230606 0.220118 0.256386 0.353956
chargesum: 0.00000
title: Mulliken charges with hydrogens summed into heavy atoms:
elementType: Cl O C C C C C C C C C C C C C C
charge: -0.071290 -0.086958 -0.127069 -0.127869 0.556436 0.536376 -0.272729 -0.204295 -0.120000 -0.177531 0.302585 0.033203 -0.086534 0.023739 -0.190445 0.012381
polarizability: 2.36441578e+02 -7.74726354e+00 1.71837220e+02 -1.72445304e+01 -5.82777682e+00 7.68765664e+01
1716.lowfreq: -12.7289 -3.3263 -0.0012 -0.0012 0.0006 6.3661 9.9739 25.7362 32.9493
frequency: 9.2144 25.7100 32.9058 53.5289 103.8644 178.3262 205.9400 222.2773 238.8903 286.6941 288.3826 366.6413 370.0797 392.9855 428.4267 435.9576 453.1350 511.1263 522.2951 527.6629 590.0859 628.2580 670.2541 695.8332 697.0975 741.7990 780.5688 786.3085 791.3461 849.5327 874.8047 890.4097 892.1098 905.3179 930.8519 961.7079 977.3181 984.1352 984.8602 996.9324 1005.0310 1072.4070 1079.8268 1095.0282 1138.6285 1140.6026 1172.9859 1176.9380 1181.2979 1214.6932 1260.9435 1266.3357 1276.1412 1296.2935 1310.4879 1324.4858 1377.4774 1393.1365 1422.0064 1464.5408 1467.9150 1473.9410 1479.1031 1488.2185 1576.6413 1594.3380 1607.0505 1628.2482 2990.4826 2999.5434 3040.1119 3067.0030 3112.7711 3126.3622 3126.8156 3144.5780 3145.0768 3149.3541 3155.2743 3172.8245 3579.7635
redmass: 6.1721 5.8266 3.6036 4.4624 5.4231 5.5172 4.0375 4.4198 4.5519 3.1113 3.6339 1.1139 3.8704 5.8769 3.0334 3.0571 3.0666 6.5385 5.0685 5.7210 4.5471 5.2289 5.7476 2.7184 2.0377 3.4679 1.6055 1.3686 1.3450 2.4792 1.5867 1.8289 1.4835 1.3896 2.7607 1.3300 1.3537 5.5743 6.1926 2.0978 3.3023 2.1389 1.6383 1.5252 1.4349 1.1246 1.2129 1.0880 1.3426 2.3274 1.6667 1.2632 2.0809 1.2944 1.2748 1.3975 8.0828 6.8709 2.5745 2.4326 2.5801 1.2346 2.2575 1.1051 6.4467 6.4632 6.8421 6.3456 1.0591 1.0596 1.1016 1.1051 1.0881 1.0877 1.0899 1.0921 1.0924 1.0931 1.0987 1.0978 1.0660
irintensity: 0.7017 0.3545 0.1069 0.8366 0.2801 0.0465 0.6696 0.5868 0.6653 5.8364 7.1725 141.4809 8.1046 1.2598 7.4761 3.9594 9.6324 0.8752 3.9898 1.9655 0.5129 0.3330 18.1827 8.9850 63.0304 0.5583 50.2166 9.3459 40.7423 30.6930 13.2999 25.1004 30.7809 2.9871 34.0760 0.4921 0.5416 1.3512 3.4827 4.1192 1.4694 21.0822 20.7510 0.4136 140.0647 4.4099 12.5290 0.6380 30.6824 12.3736 24.5674 1.1159 26.7499 0.3279 14.6408 0.1848 0.9377 12.3756 19.2369 30.4156 22.7757 7.3944 28.8352 13.2230 53.0786 61.7792 46.3841 72.6503 1.0202 54.3996 0.1275 25.0626 9.9853 6.6224 20.4232 8.9995 8.2654 10.9970 16.5264 7.6268 35.3111
temp: 298.150 k
press: 1.00000 atm
elementType: 17 8 6 6 6 6 6 6 6 6 6 6 6 6 6 6 1 1 1 1 1 1 1 1 1 1 1 1 1
symmnumber: 1
zpe: 598601.0 jmol-1
zpe.correction: 0.227995 hartree
zpe.thermalcorrener: 0.242466 hartree
zpe.thermalcorrenthalpy: 0.243411 hartree
zpe.thermalcorrgfe: 0.182769 hartree
zpe.sumelectzpe: -1075.436881 hartree
zpe.sumelectthermal: -1075.422409 hartree
zpe.sumelectthermalent: -1075.421465 hartree
zpe.sumelectthermalfe: -1075.482107 hartree
dipole: -2.7271 0.3908 0.4288
dipole: 2.7882
quadrupole: -90.3638 -95.2136 -106.5578
quadrupole: 12.5548 -5.3033 -1.4752
quadrupole: 7.0146 2.1648 -9.1794 12.5548 -5.3033 -1.4752
hfenergy: -1075.6648759 hartree
pointgroup: C01 [X(C14H13Cl1O1)]
dipole: 1.0577583 -0.2299566 0.1776501 debye
polarizability: 234.7089518|-12.2854845|173.2978228|18.9046057|4.2663387|77.1485891 unknown
InChI: InChI=1S/C14H13ClO/c15-13-5-1-3-11(9-13)7-8-12-4-2-6-14(16)10-12/h1-6,9-10,16H,7-8H2
charge 0 multiplicity 1
29 atoms
Cl -5.210606 2.033591 -0.118535
O  4.948228 -1.771641 0.094084
C  0.427646 0.085855 -0.659198
C  -0.390826 -0.116984 0.6588
C  1.907725 0.298883 -0.380674
C  -1.87163 -0.3262 0.385059
C  2.782605 -0.808284 -0.286744
C  2.424335 1.605076 -0.166015
C  -2.745257 0.788424 0.293081
C  -2.400675 -1.625759 0.171907
C  4.14774 -0.615418 0.020742
C  3.790049 1.791277 0.139191
C  -4.103641 0.582804 -0.008831
C  -3.768606 -1.809657 -0.129252
C  4.663342 0.684945 0.23703
C  -4.640679 -0.700524 -0.224914
H  0.008456 0.95492 -1.20068
H  0.27744 -0.800849 -1.303357
H  -0.236901 0.767757 1.304646
H  0.027092 -0.987805 1.197797
H  2.423189 -1.829404 -0.456328
H  1.757564 2.471712 -0.247318
H  -2.36731 1.802597 0.462505
H  -1.737822 -2.49588 0.249578
H  4.18377 2.80118 0.298791
H  -4.1673 -2.817486 -0.288146
H  5.725701 0.83385 0.472349
H  -5.702007 -0.831089 -0.455554
H  5.885175 -1.536292 0.308285
