program: Gaussian 09
title: 000223548
version: EM64L-G09RevD.01
frameworkgroup: C1[X(C14H10Br2O2)]
method: RPBEPBE
basis: SDD
operation: Freq
keyword: #p
keyword: freq=noraman
keyword: PBEPBE/SDD
title: #p freq=noraman PBEPBE/SDD
converged: YES YES NO NO
title: Mulliken charges:
elementType: Br Br O O C C C C C C C C C C C C C C H H H H H H H H H H
charge: 0.026586 0.012793 -0.308064 -0.232833 0.613838 0.555616 -0.595399 -0.448849 -0.320329 -0.167934 -0.802000 0.212565 0.162883 -0.328501 -0.299501 -0.221976 -0.224272 -0.220656 0.318138 0.255601 0.241498 0.260095 0.259913 0.269051 0.274083 0.236281 0.236158 0.235216
chargesum: 0.00000
title: Mulliken charges with hydrogens summed into heavy atoms:
elementType: Br Br O O C C C C C C C C C C C C C C
charge: 0.026586 0.012793 -0.308064 -0.232833 0.613838 0.555616 -0.595399 -0.448849 -0.002191 0.087667 -0.040494 0.212565 0.162883 -0.059450 -0.025419 0.014304 0.011886 0.014560
polarizability: 3.30480865e+02 1.38236545e+01 2.03341282e+02 1.92985644e-02 1.00746243e-01 7.19614062e+01
1716.lowfreq: -8.8814 -6.6906 -0.0007 -0.0005 -0.0003 3.0988 7.6930 29.8565 53.3564
frequency: 6.9234 29.8558 53.3227 59.7397 72.9086 114.7208 124.1145 134.5043 143.4074 175.7449 192.0294 242.0639 266.9103 289.6917 305.3170 334.0224 358.3004 402.8469 438.8183 465.3578 493.3292 505.3021 551.5067 577.9315 613.1278 619.6104 671.1998 683.6360 700.2363 730.2245 741.9719 779.0200 795.6418 830.4954 866.0119 924.7518 959.6081 967.5382 988.9361 997.8075 999.2973 1011.8188 1018.7106 1025.6107 1041.7399 1049.1893 1087.4614 1150.4261 1175.3433 1183.6134 1205.7344 1220.5021 1242.9515 1318.4745 1346.1477 1380.1428 1390.9875 1402.1384 1423.1746 1438.9572 1466.3768 1470.2572 1476.3106 1548.7824 1580.6538 1585.4523 1610.2171 1632.2409 2993.6584 3068.8689 3123.5788 3132.8649 3145.2501 3156.7791 3167.9234 3172.1693 3176.8270 3212.9241
redmass: 6.4916 6.0893 8.3268 5.9697 3.5057 7.2059 1.1064 17.7343 10.3363 5.6051 14.0406 3.9558 6.4071 5.9895 5.2861 7.3465 8.4079 2.8324 3.7947 6.9594 4.4619 3.9731 6.2181 4.3410 6.4444 8.0978 5.1800 7.5274 1.6431 5.1403 7.4881 8.5618 2.0819 1.3679 1.2441 4.3400 1.4131 1.3308 5.9320 2.7226 1.3848 1.3336 4.8168 2.1844 1.4954 3.0336 1.6118 1.5012 1.0613 1.1954 1.8024 3.3919 3.9995 1.3131 7.8074 5.0484 9.8627 1.3009 2.1584 2.2468 1.1704 1.0433 2.2304 5.7547 8.5129 6.6150 6.0161 11.0798 1.0390 1.0973 1.0972 1.0857 1.0891 1.0937 1.0972 1.0916 1.0996 1.0947
irintensity: 1.2104 0.0427 0.6601 1.0727 0.2149 0.1719 0.8587 0.0032 0.0705 0.6060 0.5089 7.3408 1.2302 8.7031 12.0917 0.4974 0.9327 0.0006 0.5679 3.9818 0.7244 0.1769 2.2140 2.9639 0.9612 7.4746 17.2209 43.3683 84.7687 0.0515 9.3702 20.9651 25.4815 53.7235 0.0157 51.4520 3.4595 4.2295 45.3417 188.0965 0.0425 0.2605 132.2531 16.6092 5.6481 242.8077 13.1760 5.9815 4.4615 163.0211 224.9786 306.4917 65.9137 0.4582 26.2428 70.7999 3.1707 43.2009 114.5381 11.4513 75.3720 14.5747 6.8088 6.9882 3.8466 14.6396 20.9760 168.3147 10.6538 9.8008 7.7893 0.4196 9.8726 11.3788 12.8853 2.2188 22.7073 12.2354
temp: 298.150 k
press: 1.00000 atm
elementType: 35 35 8 8 6 6 6 6 6 6 6 6 6 6 6 6 6 6 1 1 1 1 1 1 1 1 1 1
symmnumber: 1
zpe: 520627.0 jmol-1
zpe.correction: 0.198296 hartree
zpe.thermalcorrener: 0.215224 hartree
zpe.thermalcorrenthalpy: 0.216168 hartree
zpe.thermalcorrgfe: 0.149031 hartree
zpe.sumelectzpe: -715.600112 hartree
zpe.sumelectthermal: -715.583185 hartree
zpe.sumelectthermalent: -715.582241 hartree
zpe.sumelectthermalfe: -715.649378 hartree
dipole: 2.2706 1.2767 0.0115
dipole: 2.6049
quadrupole: -101.3550 -118.0265 -127.5837
quadrupole: 0.6253 0.0324 0.0071
quadrupole: 14.3001 -2.3714 -11.9286 0.6253 0.0324 0.0071
hfenergy: -715.7984087 hartree
pointgroup: C01 [X(C14H10Br2O2)]
dipole: -0.8800261 0.5198947 0.074904 debye
polarizability: 329.5981966|-16.3856767|202.1632691|-6.7378121|16.0300622|74.0220873 unknown
InChI: InChI=1S/C14H10Br2O2/c1-9-11(15)7-8-12(13(9)16)18-14(17)10-5-3-2-4-6-10/h2-8H,1H3
charge 0 multiplicity 1
28 atoms
Br 1.006221 2.585058 0.30537
Br 5.863223 -0.691237 -0.187631
O  -0.288493 -0.087197 0.006552
O  -1.043502 -2.310042 -0.248782
C  3.327233 0.824276 0.047088
C  1.104772 -0.305865 -0.047124
C  1.905686 0.859496 0.079161
C  3.907975 -0.463428 -0.121341
C  1.729044 -1.564642 -0.213012
C  3.134455 -1.632875 -0.248964
C  4.139291 2.093709 0.18503
C  -2.640029 -0.483144 -0.002082
C  -1.287166 -1.09219 -0.097951
C  -3.759062 -1.354442 -0.086944
C  -2.836826 0.913123 0.167804
C  -5.064944 -0.832777 -0.002365
C  -4.146964 1.427896 0.251736
C  -5.261293 0.55916 0.167222
H  1.123083 -2.464852 -0.311287
H  3.622571 -2.602292 -0.376987
H  5.21813 1.886062 0.145757
H  3.890554 2.806944 -0.621781
H  3.91481 2.600611 1.141034
H  -3.582526 -2.427134 -0.217892
H  -1.966995 1.573066 0.231327
H  -5.926964 -1.504995 -0.067835
H  -4.300984 2.504227 0.382547
H  -6.277304 0.964183 0.232851
