program: Gaussian 09
title: 000223542
version: EM64L-G09RevD.01
frameworkgroup: C1[X(C12H18N4O3)]
method: RPBEPBE
basis: SDD
operation: Freq
keyword: #p
keyword: freq=noraman
keyword: PBEPBE/SDD
title: #p freq=noraman PBEPBE/SDD
converged: YES YES NO NO
title: Mulliken charges:
elementType: O O O N N N N C C C C C C C C C C C C H H H H H H H H H H H H H H H H H H
charge: -0.288609 -0.282076 -0.275901 -0.210958 -0.155858 -0.223115 -0.140720 0.343552 0.121417 0.084843 0.257804 0.161452 -0.717307 -0.707283 -0.717210 0.209749 -0.616413 -0.617543 -0.602177 0.223620 0.214877 0.273551 0.230024 0.230008 0.210009 0.273454 0.214875 0.223630 0.249430 0.255765 0.255565 0.241816 0.274145 0.241822 0.268224 0.247765 0.247771
chargesum: 0.00000
title: Mulliken charges with hydrogens summed into heavy atoms:
elementType: O O O N N N N C C C C C C C C C C C C
charge: -0.288609 -0.282076 -0.275901 -0.210958 -0.155858 -0.223115 -0.140720 0.343552 0.121417 0.084843 0.257804 0.161452 -0.005259 -0.037243 -0.005250 0.209749 0.144348 0.140241 0.161582
polarizability: 2.40401706e+02 -3.56480510e+00 1.81191617e+02 6.21543009e-03 6.90600711e-03 1.03508672e+02
1716.lowfreq: -68.6342 -2.8457 -0.0008 -0.0005 0.0001 4.7882 7.4740 35.7711 52.5232
frequency: -68.6289 35.7102 52.5081 81.1813 88.3344 92.6625 93.9071 124.8999 129.3799 134.1581 163.5712 196.9006 226.1846 227.1583 235.3870 237.2462 250.2912 255.6138 299.6582 313.4732 335.6160 345.4760 371.0107 377.0932 385.1242 412.9592 430.0359 430.6033 466.6935 494.4949 568.9601 599.4641 642.3232 686.3580 703.0120 717.2269 732.7207 734.5814 771.7537 799.5652 848.6286 913.9790 922.4884 956.6275 958.5510 963.5314 1027.0678 1032.5261 1032.6816 1048.2326 1129.0152 1129.9977 1131.5261 1160.7171 1171.9645 1190.3954 1214.5110 1229.2851 1258.2568 1263.6578 1275.2004 1298.6572 1358.0906 1375.2750 1380.0068 1396.5726 1403.3956 1411.1999 1426.7567 1443.7498 1445.1427 1461.8272 1465.6336 1466.9048 1468.1359 1472.7760 1475.8634 1476.9178 1479.0615 1479.4868 1480.4074 1496.7998 1503.2851 1506.9765 1576.2679 1615.1347 1653.3914 2991.3868 2993.6141 2998.5028 3003.6966 3009.9561 3013.9780 3084.5730 3088.0486 3091.8620 3101.0426 3101.0969 3101.5484 3104.9885 3113.4991 3117.1848 3135.7785 3135.7897 3136.0064
redmass: 1.0703 3.4781 3.2160 1.0752 3.3375 3.5516 4.1633 1.9212 3.3393 1.6244 1.0866 4.1428 2.0174 4.7090 1.3296 1.3253 3.0448 2.5214 2.7523 4.7555 3.1834 3.3278 7.4101 3.3277 6.6543 4.0434 4.1122 2.8876 5.1122 4.8201 6.6192 5.1748 10.8239 11.9025 11.3297 6.2328 11.1537 7.9250 4.1950 4.4246 5.3896 1.5843 1.6042 6.3532 1.2044 2.6205 2.4481 1.4856 1.4307 3.0565 1.3048 1.2963 1.3028 2.7708 2.0340 3.6008 4.7671 2.8308 3.0140 5.9654 3.3282 6.5817 5.1469 1.2260 1.2451 1.9864 1.2964 1.3283 1.2590 1.0454 3.0717 1.6108 1.0542 1.0563 1.0429 1.1354 1.0433 1.1464 1.0441 1.1159 1.0507 1.7933 1.2686 1.7709 7.9999 10.7814 10.6693 1.0359 1.0357 1.0362 1.0336 1.0328 1.0332 1.0993 1.0991 1.1025 1.1021 1.0992 1.1005 1.1023 1.1005 1.0998 1.1010 1.1020 1.1022
irintensity: 0.0969 0.5744 0.0174 0.0240 0.0004 1.5123 0.1561 1.8950 16.6888 0.2399 0.1153 12.8347 0.6098 0.2041 0.0677 0.0005 0.3711 0.7491 4.3011 1.2683 2.0817 6.5959 0.0005 8.6257 13.2628 6.4073 6.7679 2.9522 18.9398 18.9860 7.9944 15.0551 6.2767 1.6318 7.5119 18.5656 14.9029 0.9993 5.5269 3.1837 102.3114 0.5508 4.6398 31.2655 0.1449 57.6495 52.2539 1.7064 0.0039 16.5389 0.6026 0.2601 0.0027 198.4022 193.8870 51.0474 26.6399 4.3248 25.5533 43.8723 43.5751 35.5790 54.5458 45.1481 24.7564 17.1002 51.6045 1.9730 101.0941 1.0951 649.7490 7.7170 7.4477 8.5815 9.3580 45.6591 17.7457 20.8544 19.0947 7.4921 0.3788 237.6125 74.6141 63.9780 49.2913 486.4101 512.0027 22.7605 10.0295 33.5619 39.1146 32.7530 24.7330 8.7659 17.5319 20.1364 17.4315 46.9786 27.4520 14.4599 4.1043 13.1580 0.2046 4.0041 0.5840
temp: 298.150 k
press: 1.00000 atm
elementType: 8 8 8 7 7 7 7 6 6 6 6 6 6 6 6 6 6 6 6 1 1 1 1 1 1 1 1 1 1 1 1 1 1 1 1 1 1
symmnumber: 1
zpe: 780218.9 jmol-1
zpe.correction: 0.297170 hartree
zpe.thermalcorrener: 0.316812 hartree
zpe.thermalcorrenthalpy: 0.317756 hartree
zpe.thermalcorrgfe: 0.249724 hartree
zpe.sumelectzpe: -911.356056 hartree
zpe.sumelectthermal: -911.336414 hartree
zpe.sumelectthermalent: -911.335470 hartree
zpe.sumelectthermalfe: -911.403502 hartree
dipole: 6.0093 -0.4408 -0.0002
dipole: 6.0255
quadrupole: -111.4778 -115.9636 -111.2781
quadrupole: -2.7390 -0.0035 0.0014
quadrupole: 1.4287 -3.0571 1.6284 -2.7390 -0.0035 0.0014
hfenergy: -911.653226 hartree
pointgroup: C01 [X(C12H18N4O3)]
dipole: 2.3637795 0.1797278 0.0005873 debye
polarizability: 240.3822417|3.7228566|181.2109969|0.0315006|-0.0767939|103.5087558 unknown
InChI: InChI=1S/C12H18N4O3/c1-12(2,3)19-10-13-8-7(14(10)4)9(17)16(6)11(18)15(8)5/h1-6H3
charge 0 multiplicity 1
37 atoms
O  2.715975 -0.713858 0.000662
O  -2.452204 -2.551384 0.0020
O  -3.85443 1.956519 -0.003647
N  0.462543 -1.402031 0.001067
N  -1.542656 1.549059 -0.002689
N  -3.126888 -0.272645 -0.000908
N  0.832478 0.865873 -0.001414
C  3.812792 0.362958 0.000594
C  -0.80281 -0.773522 0.000011
C  -0.530122 0.602811 -0.001436
C  1.397863 -0.377087 0.000102
C  -2.128462 -1.321366 0.00049
C  3.685052 1.206131 1.282788
C  5.085038 -0.498397 0.003034
C  3.687881 1.20299 -1.283945
C  -2.896924 1.12862 -0.002446
C  0.732759 -2.846596 0.002376
C  -1.227877 2.989404 -0.004295
C  -4.549776 -0.681791 -0.000712
H  3.720281 0.560025 2.177474
H  4.53146 1.91466 1.336562
H  2.743991 1.778019 1.284591
H  5.121584 -1.142998 -0.891787
H  5.120026 -1.140336 0.89983
H  5.976253 0.153557 0.00283
H  2.746444 1.774233 -1.289551
H  4.533947 1.911972 -1.337181
H  3.725873 0.554787 -2.176996
H  1.823413 -2.991183 0.005613
H  0.287192 -3.317304 0.89363
H  0.292584 -3.318133 -0.89116
H  -0.640867 3.251444 0.892235
H  -2.18234 3.535682 -0.005439
H  -0.639952 3.249202 -0.900873
H  -4.571652 -1.781422 0.000729
H  -5.058622 -0.284691 -0.894383
H  -5.059049 -0.282298 0.891643
