program: Gaussian 09
title: 000223537
version: EM64L-G09RevD.01
frameworkgroup: C1[X(C9H10Cl2S)]
method: RPBEPBE
basis: SDD
operation: Freq
keyword: #p
keyword: freq=noraman
keyword: PBEPBE/SDD
title: #p freq=noraman PBEPBE/SDD
converged: YES YES NO NO
title: Mulliken charges:
elementType: Cl Cl S C C C C C C C C C H H H H H H H H H H
charge: -0.080770 -0.063001 0.212367 -0.315970 -0.672541 -0.151668 -0.565316 -0.240937 -0.160390 -0.204361 -0.243447 -0.096651 0.234291 0.267405 0.261516 0.266627 0.258832 0.275517 0.247204 0.255194 0.257456 0.258645
chargesum: 0.00000
title: Mulliken charges with hydrogens summed into heavy atoms:
elementType: Cl Cl S C C C C C C C C C
charge: -0.080770 -0.063001 0.212367 0.185727 -0.144398 -0.151668 -0.030967 0.006267 0.094803 0.053094 0.015198 -0.096651
polarizability: 1.85148692e+02 -1.98181011e+01 1.37344427e+02 5.90831094e+00 8.58404523e+00 7.02805272e+01
1716.lowfreq: -6.1711 -5.1434 -0.0029 -0.0017 0.0014 6.7848 29.1521 31.8154 56.8807
frequency: 29.1091 31.7923 56.7961 97.6441 112.5205 188.2711 210.6604 236.8830 280.5520 285.4316 308.7888 354.2750 408.3726 434.9994 482.2298 494.9393 591.0014 620.7541 691.6866 693.5087 712.7523 760.0666 814.3919 822.0502 864.5013 942.5454 957.8290 959.5023 989.2230 1017.0331 1065.1892 1075.1378 1076.0586 1114.9917 1136.4394 1175.3688 1192.3143 1263.5650 1268.2125 1295.1458 1304.2876 1354.6332 1356.0965 1388.5902 1451.1143 1452.0929 1457.9263 1468.6126 1576.7733 1581.1749 2993.2503 3030.0856 3049.9715 3062.3385 3099.6321 3137.4756 3140.8304 3149.6722 3171.2306 3174.1206
redmass: 4.6456 8.4610 4.5659 8.9382 7.5041 3.7377 3.3204 3.1142 5.8216 3.9944 8.8042 4.1201 2.9514 4.5697 3.1479 8.3642 4.3761 7.0502 4.0793 3.9981 7.1907 1.2717 1.4350 1.2564 1.7792 1.3152 1.5102 1.7019 5.1424 1.7130 6.1376 2.1074 2.1086 1.4009 1.2344 1.2336 1.1363 1.1982 1.2147 1.2337 1.1481 1.9046 2.5219 3.7349 1.0976 1.1448 1.3615 1.3990 7.2357 6.2544 1.0635 1.0594 1.0692 1.0844 1.1056 1.1112 1.0895 1.0885 1.0957 1.0968
irintensity: 0.8056 2.2883 1.2871 1.9419 2.6187 0.4584 1.8808 0.5010 0.1211 0.7739 0.7309 3.0876 0.2373 2.8525 25.9271 32.7188 19.1433 0.1381 3.0161 5.4010 2.5427 16.7196 68.3520 6.9699 9.2843 0.0690 1.6244 6.3922 60.4336 2.4791 11.3427 19.5554 51.1233 7.1068 0.8661 4.2902 3.9801 7.9781 5.2226 0.9061 10.6312 8.4023 3.8530 2.7456 5.8005 20.4913 83.9143 42.9816 2.0364 1.7852 10.5983 14.5912 13.8578 24.0830 11.9755 12.8245 3.6006 0.6854 4.3556 1.2732
temp: 298.150 k
press: 1.00000 atm
elementType: 17 17 16 6 6 6 6 6 6 6 6 6 1 1 1 1 1 1 1 1 1 1
symmnumber: 1
zpe: 433720.7 jmol-1
zpe.correction: 0.165196 hartree
zpe.thermalcorrener: 0.177800 hartree
zpe.thermalcorrenthalpy: 0.178744 hartree
zpe.thermalcorrgfe: 0.123367 hartree
zpe.sumelectzpe: -1666.241370 hartree
zpe.sumelectthermal: -1666.228766 hartree
zpe.sumelectthermalent: -1666.227822 hartree
zpe.sumelectthermalfe: -1666.283198 hartree
dipole: -3.2522 1.5520 1.2506
dipole: 3.8144
quadrupole: -87.5248 -96.2218 -93.9881
quadrupole: 0.0241 -3.6138 1.0535
quadrupole: 5.0534 -3.6436 -1.4098 0.0241 -3.6138 1.0535
hfenergy: -1666.4065654 hartree
pointgroup: C01 [X(C9H10Cl2S1)]
dipole: 1.2971598 -0.743922 -0.1267684 debye
dipolederiv: -0.288109 0.0631252 -0.0130801 -0.0525507 -0.5556896 -0.043962 -0.04747 -0.0357979 -0.1955187 -0.6576373 0.2022286 0.2907436 0.2350069 -0.2112595 -0.148734 0.3307185 -0.1480298 -0.2556256 -0.5362953 0.0817445 0.1094294 0.1540414 -0.0426999 -0.0176205 0.2527031 -0.0085209 -0.2082981 -0.0806648 0.0083709 -0.0128278 -0.2219876 -0.118936 -0.0233118 0.03964 0.0190838 0.0125749 0.3432377 0.068687 0.0610963 0.1374569 0.0360036 -0.0456545 0.0430724 0.0189813 0.089763 0.6965316 -0.2800419 -0.3943914 -0.4020226 -0.0166249 0.109196 -0.5235765 0.1086933 0.1252174 0.2350702 -0.0929698 -0.0415441 0.0007028 0.7407357 0.0605763 -0.1075537 0.0276229 0.159185 -0.2929721 0.0980434 0.0897412 0.1022211 0.0347984 0.0623247 0.0932262 0.068112 -0.1151089 -0.1602846 0.07027 0.0615041 0.2082606 -0.0780756 -0.0217112 0.150355 -0.0191753 -0.1723504 -0.1077939 0.0982564 0.0477293 0.0664375 -0.0297003 0.0161493 0.0396536 0.0089376 -0.1094404 -0.1372133 0.083694 0.0536908 0.0742861 -0.0136723 0.0196385 0.0462816 0.0212653 -0.1068587 0.8073856 -0.3237038 -0.4670047 -0.3249021 0.1569321 0.234805 -0.4793324 0.2480389 0.2089769 0.0383231 0.0027823 -0.053124 0.0941809 -0.1008477 0.0258129 -0.0131743 -0.0367308 0.0746798 0.006856 -0.0298051 0.0914418 0.0107459 0.0929637 -0.02558 0.0894578 -0.0207886 -0.0103607 -0.0774641 0.0209136 0.1008205 0.0146538 0.0918856 -0.0423894 0.0273544 -0.0191689 -0.0062564 0.0345127 0.0157859 -0.0317199 0.0077394 -0.0719764 0.0598493 -0.068334 -0.0171605 0.0822616 -0.0291413 0.0168624 0.076541 0.0227928 -0.0295352 -0.0173003 0.1494182 -0.000032 0.0128355 0.0156493 0.0253488 -0.0679133 0.0093033 -0.0283263 0.0173164 -0.1243412 0.0081346 -0.0626824 0.1031789 0.0162861 0.0325272 -0.0066503 -0.0123229 -0.0892258 0.0139906 -0.0986305 0.098697 0.0183459 -0.060508 0.0275816 -0.063989 0.0689716 -0.0196549 0.0393676 -0.0151639 0.1213765 -0.0222839 -0.0733018 0.0197288 -0.0651688 0.0810615 -0.026024 0.0282182 -0.024175 0.1458193 0.0907685 -0.0120688 0.0190301 -0.0005581 0.0063145 -0.0844999 0.0203249 -0.0854957 0.1111133 unknown
polarizability: 180.6372181|-6.7501748|120.1952547|-28.2877611|30.5301219|91.9411733 unknown
InChI: InChI=1S/C9H10Cl2S/c10-6-1-7-12-9-4-2-8(11)3-5-9/h2-5H,1,6-7H2
charge 0 multiplicity 1
22 atoms
Cl 3.388328 2.128053 0.667384
Cl -4.14959 1.019835 1.433497
S  0.931815 -1.469984 -1.710879
C  2.920628 -0.618455 0.163121
C  2.409497 -0.382731 -1.269991
C  -0.444847 -0.696159 -0.768438
C  4.039419 0.342863 0.569115
C  -1.667573 -1.416148 -0.756108
C  -0.360776 0.550447 -0.102562
C  -2.798703 -0.897046 -0.091586
C  -1.489569 1.074004 0.570127
C  -2.692064 0.344864 0.565528
H  3.316138 -1.651174 0.243936
H  2.090889 -0.541618 0.888355
H  3.170666 -0.664027 -2.01855
H  2.139325 0.671981 -1.443837
H  4.863731 0.383483 -0.15987
H  4.424816 0.130975 1.577219
H  -1.742271 -2.383328 -1.265133
H  0.563258 1.136517 -0.093283
H  -3.740801 -1.45254 -0.085318
H  -1.423713 2.036687 1.085173
