program: Gaussian 09
title: 000223536
version: EM64L-G09RevD.01
frameworkgroup: C1[X(C9H10Cl2O)]
method: RPBEPBE
basis: SDD
operation: Freq
keyword: #p
keyword: freq=noraman
keyword: PBEPBE/SDD
title: #p freq=noraman PBEPBE/SDD
converged: YES YES NO NO
title: Mulliken charges:
elementType: Cl Cl O C C C C C C C C C H H H H H H H H H H
charge: -0.065359 -0.076454 -0.255749 0.510429 -0.459164 -0.239007 -0.312458 -0.323963 -0.220147 -0.235664 -0.562501 -0.218187 0.220043 0.234710 0.240501 0.218377 0.253759 0.260401 0.236918 0.274393 0.280220 0.238902
chargesum: 0.00000
title: Mulliken charges with hydrogens summed into heavy atoms:
elementType: Cl Cl O C C C C C C C C C
charge: -0.065359 -0.076454 -0.255749 0.510429 -0.004411 0.219870 -0.312458 -0.070203 0.040254 0.001254 -0.007888 0.020714
polarizability: 1.11468381e+02 1.68052570e+01 1.20725534e+02 1.18764509e+01 -3.58571335e+00 1.07730702e+02
1716.lowfreq: -11.3737 -0.0017 -0.0001 0.0004 4.3592 7.6945 18.3956 36.1281 52.0072
frequency: 17.8971 36.0259 51.6562 83.8929 111.7635 165.5577 218.4225 236.3098 283.2619 329.8328 368.7345 412.8557 424.5819 457.2281 508.5933 594.0870 657.7862 673.7305 722.8619 761.3786 786.1856 807.2330 841.4572 870.4272 950.7863 966.8080 989.7922 1010.2371 1016.7592 1029.5495 1039.4733 1057.3099 1126.9433 1172.5573 1177.1902 1203.4993 1239.1564 1250.1736 1280.0868 1286.2395 1345.6080 1360.1728 1378.8613 1425.1339 1455.1302 1455.7191 1464.7270 1470.5292 1574.1034 1603.6286 3000.0681 3005.3429 3072.2529 3075.5897 3080.3653 3133.1320 3145.7916 3162.2499 3162.9215 3177.5622
redmass: 9.5160 7.3774 2.2768 4.3116 4.9326 4.9699 5.5793 5.0494 5.1582 6.5340 4.5722 4.6428 2.6239 3.6589 4.3158 4.7805 6.1572 6.4676 4.3796 1.2905 1.1440 3.8164 4.4054 1.4426 1.4047 1.9290 1.3431 4.0519 3.5625 1.6170 2.1666 4.2308 1.6170 1.1056 1.2074 2.3973 1.3147 1.1647 1.3037 1.1761 1.2637 1.2870 4.5754 2.1620 1.3365 1.2048 1.3330 1.1979 6.1440 6.9507 1.0600 1.0595 1.0570 1.1045 1.1051 1.0869 1.0901 1.1119 1.0959 1.0995
irintensity: 0.3206 0.1602 0.7837 3.0130 2.2318 0.6471 7.1138 2.1006 7.1892 3.9833 12.0270 2.9796 5.7618 8.2292 0.3882 11.1799 9.9824 63.9204 5.2572 99.7513 5.5418 10.1381 7.4793 1.1229 1.1733 19.0580 1.4235 95.8910 42.7635 20.4703 2.9785 9.7917 2.4988 3.5855 10.2700 13.2098 4.7805 6.2874 3.9279 1.3410 5.5556 4.2950 1.7562 26.2780 19.8685 5.2409 19.4336 2.7129 11.7143 6.1635 23.1704 42.1161 11.5303 12.1243 14.6971 0.8997 6.9610 12.7809 15.0674 10.3748
temp: 298.150 k
press: 1.00000 atm
elementType: 17 17 8 6 6 6 6 6 6 6 6 6 1 1 1 1 1 1 1 1 1 1
symmnumber: 1
zpe: 441225.9 jmol-1
zpe.correction: 0.168054 hartree
zpe.thermalcorrener: 0.180223 hartree
zpe.thermalcorrenthalpy: 0.181167 hartree
zpe.thermalcorrgfe: 0.126507 hartree
zpe.sumelectzpe: -1343.383533 hartree
zpe.sumelectthermal: -1343.371364 hartree
zpe.sumelectthermalent: -1343.370419 hartree
zpe.sumelectthermalfe: -1343.425079 hartree
dipole: -3.0011 -1.4614 0.2976
dipole: 3.3512
quadrupole: -89.2712 -81.5696 -84.6599
quadrupole: 4.9294 6.5086 1.6485
quadrupole: -4.1043 3.5973 0.5070 4.9294 6.5086 1.6485
hfenergy: -1343.5515867 hartree
pointgroup: C01 [X(C9H10Cl2O1)]
dipole: -1.1891587 0.5685273 0.0324702 debye
dipolederiv: -0.1774992 0.1496262 0.1238825 0.1190498 -0.5613645 -0.262118 0.108598 -0.2534655 -0.248269 -0.4247687 0.1225004 -0.1830912 0.2051896 -0.2812987 0.1610311 -0.2211082 0.1062827 -0.3711961 -0.9939212 0.02023 -0.09614 0.12002 -0.3351916 0.1120891 -0.3094375 0.100478 -0.7059139 -0.1196558 0.0592636 -0.0022618 -0.0044905 -0.2524307 -0.1218758 0.0661274 -0.0872772 -0.1520632 0.866812 0.0368382 0.0834219 0.1324145 0.2134171 0.0999049 -0.0079427 -0.0337229 0.4366468 0.4594945 -0.0031981 0.0181603 -0.2328643 0.2021442 -0.0293238 0.3256984 -0.104324 0.438676 0.0771837 -0.2601746 -0.2370642 -0.1265052 0.7870539 0.396084 -0.2064252 0.4182111 0.2613029 -0.0787843 0.0251209 -0.0845672 0.0212609 0.0770098 -0.0188 -0.0553207 0.0338662 -0.0749738 -0.1211502 0.1101215 0.0481678 0.0966091 -0.1202444 -0.1217332 0.0506068 -0.1235381 -0.164113 -0.1124464 -0.0612317 -0.0519229 -0.0607995 0.0266071 0.0771188 -0.0717876 0.0937556 -0.0733384 0.4560118 -0.1745273 0.2544512 -0.228868 0.3414351 -0.213365 0.2538986 -0.1385557 0.2432793 -0.0387905 0.0364602 -0.1290341 -0.0029535 0.0449391 0.0240177 -0.1213206 -0.0187102 0.0034393 -0.0224253 0.01858 0.0014836 -0.0124 -0.0230247 -0.1707958 -0.0020733 -0.0460477 0.0098061 -0.0428846 0.0347475 -0.0366142 0.0251322 -0.0154635 0.1333488 -0.0352381 0.0580229 0.0089484 -0.1507032 -0.0180674 0.0479123 -0.0148292 0.0791141 0.0264593 -0.0041869 0.0245734 0.0437585 0.0815292 -0.0519923 -0.0518438 0.0303897 -0.0956164 -0.05199 -0.0641158 -0.0436725 0.0003571 0.1206755 -0.0623893 0.0485797 -0.0496314 -0.0405883 0.0188917 0.0418789 0.0313372 0.0930488 0.1186481 -0.0350891 0.039172 -0.0560168 -0.021412 0.0270565 0.0477947 0.0157925 0.1203493 0.0986214 0.0460208 0.0704912 0.0576051 -0.0320323 -0.0833916 0.0801044 -0.0817413 0.0705599 0.0390533 0.0277858 -0.0411654 0.0048929 -0.0859719 -0.0479724 -0.0504581 0.0000176 0.0268555 -0.076263 -0.0048229 0.0517244 -0.0032716 0.0158387 0.0375708 0.0385821 0.0425348 0.0171979 0.0412627 -0.0158023 0.1262579 -0.0199338 0.0770799 0.007793 0.1361253 0.0061832 0.0156415 unknown
polarizability: 116.7422712|-8.2564919|120.4972891|-17.6759788|3.5079642|102.6850556 unknown
InChI: InChI=1S/C9H10Cl2O/c10-5-6-12-7-8-3-1-2-4-9(8)11/h1-4H,5-7H2
charge 0 multiplicity 1
22 atoms
Cl -0.413865 -2.264717 -1.34899
Cl 3.706644 -0.745369 1.635017
O  1.792684 1.268487 -1.42145
C  -0.526318 0.513205 -0.825268
C  0.496178 0.761799 -1.923082
C  2.632694 0.267785 -0.73516
C  -1.009387 -0.767046 -0.466716
C  -1.037289 1.619481 -0.091831
C  -1.947782 -0.968185 0.566025
C  -1.974234 1.449978 0.94751
C  2.451617 0.391031 0.78237
C  -2.431284 0.151937 1.277676
H  0.656724 -0.149455 -2.529144
H  0.151018 1.575259 -2.584194
H  3.673838 0.509774 -1.009185
H  2.397544 -0.758065 -1.079307
H  -0.671276 2.620473 -0.347993
H  -2.290877 -1.978212 0.806986
H  -2.349163 2.320697 1.495305
H  2.676291 1.407683 1.135008
H  1.463359 0.061929 1.13065
H  -3.160216 0.00643 2.081772
