program: Gaussian 09
title: 000223528
version: EM64L-G09RevD.01
frameworkgroup: C1[X(C7H5BrCl2O)]
method: RPBEPBE
basis: SDD
operation: Freq
keyword: #p
keyword: freq=noraman
keyword: PBEPBE/SDD
title: #p freq=noraman PBEPBE/SDD
converged: NO NO NO NO
title: Mulliken charges:
elementType: Br Cl Cl O C C C C C C C H H H H H
charge: 0.045448 0.010163 -0.044072 -0.380902 0.648839 -0.430948 -0.360926 0.518343 -0.211415 -0.777664 -0.405811 0.278555 0.253449 0.242597 0.253434 0.360907
chargesum: 0.00000
title: Mulliken charges with hydrogens summed into heavy atoms:
elementType: Br Cl Cl O C C C C C C C
charge: 0.045448 0.010163 -0.044072 -0.019995 0.648839 -0.430948 -0.360926 0.518343 0.067140 -0.028183 -0.405811
polarizability: 1.61676841e+02 -5.53847389e-01 1.37740141e+02 -4.90581521e-04 2.64056453e-03 4.49600772e+01
1716.lowfreq: -2.4399 0.0012 0.0013 0.0018 7.5750 10.5191 74.6743 84.1524 107.2874
frequency: 74.6681 84.1505 107.2864 136.3179 146.6915 185.9209 257.4467 273.6738 289.7601 308.3444 344.1674 348.6274 414.6351 436.2943 511.5692 565.1057 603.8641 636.1597 664.4323 731.8297 763.0379 853.6345 955.0401 1029.7376 1043.4784 1063.8379 1182.2982 1201.2361 1253.0917 1359.7657 1400.0997 1413.9544 1426.0464 1463.8309 1468.4355 1557.7100 1588.6567 2997.3682 3074.3363 3125.4417 3187.1732 3482.5251
redmass: 1.0948 5.8007 5.1815 6.8755 21.8893 34.9369 10.6485 4.3266 6.2536 4.4214 9.2627 13.5003 7.3000 1.1028 4.4538 4.2728 5.7771 6.0162 9.9212 6.3768 7.7710 1.3945 3.2060 1.7325 1.4964 10.6441 1.5401 1.4648 7.4748 6.2755 1.5411 2.6379 3.4308 1.1732 1.0438 6.5674 8.5679 1.0382 1.0974 1.0983 1.0933 1.0650
irintensity: 0.3157 0.4548 0.4479 0.0501 0.1661 0.0349 2.3843 8.5574 0.8035 10.2786 0.0065 2.7481 2.4910 132.8160 9.6247 8.7469 0.3031 15.8578 77.9102 5.7549 38.7800 17.2216 0.1479 75.6284 6.1679 1.6388 165.7787 79.0620 12.9819 43.4346 54.4130 12.2347 101.6797 51.3351 16.2643 12.5502 6.9673 9.8709 9.8967 6.0041 1.0451 68.6254
temp: 298.150 k
press: 1.00000 atm
elementType: 35 17 17 8 6 6 6 6 6 6 6 1 1 1 1 1
symmnumber: 1
zpe: 263248.3 jmol-1
zpe.correction: 0.100266 hartree
zpe.thermalcorrener: 0.111654 hartree
zpe.thermalcorrenthalpy: 0.112598 hartree
zpe.thermalcorrgfe: 0.061272 hartree
zpe.sumelectzpe: -1277.741473 hartree
zpe.sumelectthermal: -1277.730085 hartree
zpe.sumelectthermalent: -1277.729141 hartree
zpe.sumelectthermalfe: -1277.780466 hartree
dipole: -0.7238 -0.6506 0.0011
dipole: 0.9732
quadrupole: -77.7666 -92.7038 -88.8478
quadrupole: -0.1539 -0.0026 0.0034
quadrupole: 8.6728 -6.2644 -2.4085 -0.1539 -0.0026 0.0034
hfenergy: -1277.8417386 hartree
pointgroup: C01 [X(C7H5Br1Cl2O1)]
dipole: 0.1790412 0.33836 0.0082306 debye
dipolederiv: -0.548405 -0.2115267 0.0004976 -0.217143 -0.2280325 -0.0041643 0.0003569 -0.0042017 0.0050519 -0.0905899 -0.0699909 -0.0012658 -0.0599335 -0.7240624 -0.0198499 -0.0010056 -0.0196621 -0.0261553 -0.5629204 0.2916169 0.0147739 0.341507 -0.3768275 -0.0136749 0.0162359 -0.0130851 -0.0536244 -1.0119315 0.4760422 0.0217203 0.5669734 -0.4376068 -0.0085545 0.0243136 -0.0075486 -0.3707938 0.0892187 0.1955324 0.0055146 0.3075221 -0.1681518 -0.0107763 0.0086815 -0.0094637 0.0708719 -0.0383218 0.2251933 0.0055018 -0.0148548 1.0344093 0.0344144 -0.001604 0.0315404 -0.1276752 0.624772 -0.5237563 -0.0244797 -0.5548229 0.4264207 0.0227817 -0.0254085 0.0224167 -0.1165776 0.598894 -0.6824026 -0.0253959 -0.6431888 0.0395184 0.0046382 -0.0240326 0.0051199 0.1399962 -0.3048154 0.1236567 0.0072543 -0.1136166 -0.1991146 -0.0042207 0.0002633 -0.0071408 -0.0114629 -0.0965273 -0.0801931 -0.0006102 -0.1747801 -0.0557276 -0.0008324 -0.0031827 -0.0019327 0.0448012 0.7964114 0.3532253 -0.001529 0.6386292 0.2015772 0.0034595 0.0068107 0.00681 -0.1770285 0.1047728 -0.0098798 0.0004743 -0.0148153 0.0210202 -0.0041134 0.0003595 -0.0041312 0.1678897 0.0534253 -0.0178647 -0.0202648 -0.0393409 0.0413601 0.0993278 0.0270209 0.0920072 -0.0108192 0.0019258 0.0449387 0.0026403 0.1461605 0.0436691 -0.003808 0.0055999 -0.0026473 0.1171383 0.0533104 -0.0210411 0.0175146 -0.0399582 0.0521386 -0.0947841 -0.0310021 -0.0879125 -0.0213193 0.3307811 -0.0935503 -0.0023462 -0.1283382 0.3294096 0.0001569 -0.0034069 -0.0001686 0.369707 unknown
polarizability: 159.1736922|7.360937|140.1496079|-1.1629378|2.7092066|45.0537587 unknown
InChI: InChI=1S/C7H5BrCl2O/c1-3-5(9)2-4(8)7(11)6(3)10/h2,11H,1H3
charge 0 multiplicity 1
16 atoms
Br 3.070008 1.692342 0.012471
Cl -0.221079 -2.917078 -0.083388
Cl -2.576403 2.172124 0.095082
O  2.292875 -1.388648 -0.068183
C  -1.296631 -0.341351 0.005387
C  -0.105879 -1.11045 -0.031651
C  -1.124227 1.066646 0.044858
C  1.193029 -0.541022 -0.03033
C  0.140088 1.686408 0.047813
C  -2.65243 -1.013694 0.002107
C  1.283238 0.873073 0.010162
H  0.225832 2.774447 0.07855
H  -2.75478 -1.687964 0.871203
H  -3.463734 -0.271977 0.033061
H  -2.775832 -1.637022 -0.901591
H  3.135621 -0.859235 -0.062149
