program: Gaussian 09
title: 000223524
version: EM64L-G09RevD.01
frameworkgroup: C1[X(C16H16N2O4S)]
method: RPBEPBE
basis: SDD
operation: Freq
keyword: #p
keyword: freq=noraman
keyword: PBEPBE/SDD
title: #p freq=noraman PBEPBE/SDD
converged: YES YES NO NO
title: Mulliken charges:
elementType: S O O O O N N C C C C C C C C C C C C C C C C H H H H H H H H H H H H H H H H
charge: 0.868037 -0.530151 -0.531029 -0.277997 -0.277693 -0.392669 -0.391051 -0.059186 -0.059831 -0.240930 -0.257919 -0.262607 -0.241326 0.298286 0.300444 -0.342181 -0.342652 -0.337143 -0.344453 0.182670 0.178338 -0.607558 -0.606980 0.281001 0.284118 0.286314 0.281121 0.288092 0.232478 0.229891 0.286094 0.311483 0.313035 0.230069 0.280111 0.230896 0.279463 0.231307 0.230110
chargesum: 0.00000
title: Mulliken charges with hydrogens summed into heavy atoms:
elementType: S O O O O N N C C C C C C C C C C C C C C C C
charge: 0.868037 -0.530151 -0.531029 -0.277997 -0.277693 -0.081186 -0.078016 -0.059186 -0.059831 0.040071 0.026198 0.023708 0.039795 0.298286 0.300444 -0.054089 -0.110175 -0.107252 -0.058359 0.182670 0.178338 0.133517 0.133900
polarizability: 3.08870063e+02 2.73662686e+00 1.84980487e+02 -1.15827879e+01 -1.06100282e+01 2.10476914e+02
1716.lowfreq: -6.4544 -3.7192 -2.0544 -0.0021 -0.0020 -0.0011 15.5950 22.7412 27.2736
frequency: 15.5273 22.7248 27.2311 51.1206 51.5336 63.5651 86.5591 89.6875 100.2681 103.8369 104.1607 149.0418 153.7760 172.2354 186.3827 199.0966 207.3240 255.4659 281.9198 291.4397 308.5953 324.8024 360.8993 367.6304 386.3994 406.1709 407.3946 425.9938 440.6309 470.5494 494.1607 526.9441 534.6671 563.7652 566.0160 617.5435 619.0519 677.1801 682.5542 683.0671 690.2195 753.7065 755.3907 784.2476 802.8944 806.3581 848.1919 850.5833 873.1990 877.0443 926.5599 968.5391 970.6024 986.6678 989.6781 994.5846 996.8056 1003.0104 1003.7932 1051.3719 1057.1397 1108.6169 1115.2323 1121.6836 1121.9735 1135.2099 1135.6923 1147.9144 1148.3278 1181.3760 1185.7241 1266.3638 1267.9798 1292.4214 1294.8586 1379.8199 1383.4637 1387.1115 1388.9123 1420.3957 1420.6375 1451.1038 1452.6012 1469.2252 1470.9850 1487.4520 1487.8507 1518.2926 1519.4359 1578.7718 1581.6395 1591.5080 1593.0361 1610.8276 1612.4567 2981.7875 2982.4420 3062.0941 3063.0211 3115.0521 3115.2284 3132.7574 3133.4937 3152.3572 3152.6337 3159.7092 3160.2167 3171.5646 3172.4364 3564.2982 3567.2858
redmass: 5.2097 5.1535 4.6739 4.1386 4.0561 4.6406 3.6852 6.7143 2.9571 1.2766 1.1912 4.2229 4.0617 6.4169 6.3735 8.9903 7.0591 6.8401 5.4563 6.5070 5.0757 4.6184 7.4790 6.2325 8.2184 2.8662 2.8730 5.9803 5.0843 6.0658 5.5972 3.6199 5.0399 1.1770 1.1785 6.6207 6.6791 4.9897 4.7242 6.1213 5.8873 3.6007 3.6134 10.2401 3.8240 4.2321 1.3422 1.3982 1.4906 1.5615 16.4605 1.4585 1.4204 4.8223 3.9290 1.4897 1.6029 3.8644 3.5112 2.3137 2.3680 1.3257 1.3378 1.2964 1.2967 1.7040 1.6792 2.8986 2.9201 1.1693 1.1642 2.2857 2.2978 1.3136 1.2934 3.6725 3.3824 6.2102 7.2718 1.1871 1.1867 1.4414 1.4052 1.7802 1.8388 1.0473 1.0466 1.5388 1.5486 7.7445 7.7157 6.1063 6.0104 7.6177 7.6547 1.0350 1.0350 1.1025 1.1025 1.0982 1.0983 1.0887 1.0886 1.0888 1.0889 1.0954 1.0954 1.0967 1.0967 1.0774 1.0773
irintensity: 1.4780 5.9023 4.6186 0.1829 6.1265 4.8491 1.8433 5.0535 1.9168 0.4577 1.5213 5.9365 2.7057 4.2975 0.8147 4.6271 2.7929 0.5324 3.2441 5.1515 21.4267 9.3213 14.8669 26.6584 18.1074 0.4711 0.1436 13.9764 20.0756 20.4226 31.6356 21.5694 101.2115 120.0425 159.1957 0.5651 1.6035 9.7636 23.9920 3.3822 42.7193 16.6219 13.6929 82.2919 5.5810 13.8757 7.9144 9.2248 18.5055 31.8633 70.8454 0.5845 3.0524 44.4597 7.8969 0.1133 2.1606 7.1592 2.7626 41.8451 12.1451 1.0522 7.8727 0.5713 0.6005 81.5035 53.2695 7.5601 2.6044 4.8568 0.8143 112.6357 90.2455 4.6788 12.5555 0.4449 6.9286 0.0999 21.3813 26.0673 37.4893 199.2190 62.7545 1.0322 1.0496 17.0155 17.3439 198.2181 102.2744 9.6636 123.3452 37.2473 4.2506 19.3622 139.5672 80.8605 71.4050 32.4645 32.7722 1.3316 1.3862 12.8542 9.4095 1.8464 2.2927 6.3635 5.7034 0.1551 0.1474 17.1175 14.5412
temp: 298.150 k
press: 1.00000 atm
elementType: 16 8 8 8 8 7 7 6 6 6 6 6 6 6 6 6 6 6 6 6 6 6 6 1 1 1 1 1 1 1 1 1 1 1 1 1 1 1 1
symmnumber: 1
zpe: 768497.7 jmol-1
zpe.correction: 0.292705 hartree
zpe.thermalcorrener: 0.315786 hartree
zpe.thermalcorrenthalpy: 0.316730 hartree
zpe.thermalcorrgfe: 0.236868 hartree
zpe.sumelectzpe: -1425.964806 hartree
zpe.sumelectthermal: -1425.941725 hartree
zpe.sumelectthermalent: -1425.940781 hartree
zpe.sumelectthermalfe: -1426.020643 hartree
dipole: 1.6909 -5.0939 -0.0158
dipole: 5.3672
quadrupole: -117.9217 -166.4566 -136.7275
quadrupole: 12.8373 -39.5746 -1.5336
quadrupole: 22.4469 -26.0881 3.6411 12.8373 -39.5746 -1.5336
hfenergy: -1426.2575109 hartree
pointgroup: C01 [X(C16H16N2O4S1)]
dipole: 0.6864026 -1.992961 -0.1262199 debye
polarizability: 309.7166465|5.1106037|186.8340616|-5.9539668|-12.2839208|207.7767569 unknown
InChI: InChI=1S/C16H16N2O4S/c1-17-15(19)11-3-7-13(8-4-11)23(21,22)14-9-5-12(6-10-14)16(20)18-2/h3-10,17-18H,1-2H3
charge 0 multiplicity 1
39 atoms
S  0.001002 2.346145 0.537773
O  0.170749 3.307599 -0.776798
O  -0.151394 2.912914 2.06652
O  -5.530523 -1.117139 -1.698464
O  5.013909 -2.291142 1.531136
N  -5.396685 -2.061567 0.427109
N  5.895142 -1.253254 -0.360499
C  -1.508169 1.236402 0.220023
C  1.492816 1.169553 0.535675
C  -1.896467 1.00183 -1.108577
C  2.177761 0.985921 -0.674271
C  -2.214671 0.75947 1.333853
C  1.880533 0.578928 1.74893
C  -3.754292 -0.347177 -0.231691
C  3.733063 -0.485142 0.534551
C  -3.034798 0.198537 -1.326136
C  3.310525 0.142272 -0.6670
C  -3.350708 -0.045143 1.095973
C  3.008695 -0.267034 1.734973
C  -4.963437 -1.19484 -0.563458
C  4.921526 -1.41794 0.611737
C  -6.56588 -2.930005 0.243467
C  7.093219 -2.100231 -0.411685
H  -1.343989 1.457019 -1.936992
H  1.84536 1.502245 -1.580818
H  -1.904104 1.041097 2.345405
H  1.332577 0.795929 2.671635
H  -3.399985 -0.009653 -2.33657
H  3.832407 -0.043071 -1.612799
H  -3.935998 -0.390554 1.955875
H  3.348464 -0.775388 2.642524
H  -4.848445 -2.157949 1.28193
H  5.826596 -0.467277 -1.007443
H  -6.281037 -3.997975 0.272373
H  -6.994645 -2.703901 -0.745483
H  -7.328655 -2.73983 1.020551
H  6.996215 -2.859328 0.380354
H  8.01024 -1.51037 -0.228351
H  7.18048 -2.606354 -1.390432
