program: Gaussian 09
title: 000223521
version: EM64L-G09RevD.01
frameworkgroup: C1[X(C12H12O3)]
method: RPBEPBE
basis: SDD
operation: Freq
keyword: #pfreq=noraman
keyword: PBEPBE/SDD
title: #p freq=noraman PBEPBE/SDD
converged: YES YES NO NO
title: Mulliken charges:
elementType: O O O C C C C C C C C C C C C H H H H H H H H H H H H
charge: -0.201439 -0.161139 -0.155206 -0.209412 -0.259366 -0.568569 0.490395 -0.761872 0.153885 0.212996 -0.413836 -0.392257 -0.232510 -0.249578 -0.237788 0.288708 0.255589 0.282307 0.284715 0.241489 0.250945 0.213920 0.236339 0.238209 0.230203 0.229595 0.233679
chargesum: 0.00000
title: Mulliken charges with hydrogens summed into heavy atoms:
elementType: O O O C C C C C C C C C C C C
charge: -0.201439 -0.161139 -0.155206 0.079296 -0.003777 -0.001546 0.490395 -0.055518 0.153885 0.212996 -0.177497 -0.154048 -0.002307 -0.019983 -0.004109
polarizability: 1.60986966e+02 6.00541936e+00 1.34067014e+02 -1.49959079e+01 1.02140636e+01 9.37245886e+01
1716.lowfreq: -0.0008 -0.0008 -0.0003 4.4670 10.7900 18.9185 30.7215 47.7817 56.8055
frequency: 30.4914 47.6739 56.5229 82.7735 135.1003 168.5465 218.9990 239.3146 259.8527 278.5387 366.2387 373.6670 403.1612 473.8496 499.3352 515.6450 535.7281 578.3331 599.0835 617.6209 627.6285 693.1904 706.5915 753.5777 765.7071 796.7454 814.0407 847.5863 855.1545 921.6428 944.9827 978.3831 984.5791 990.6174 998.3743 1021.9362 1026.9635 1043.7632 1061.5031 1091.6955 1105.1551 1139.9021 1168.4135 1175.4954 1194.2186 1208.2089 1236.8233 1259.2783 1286.9536 1302.3926 1331.4255 1350.3226 1384.1385 1405.6591 1441.0315 1443.3251 1482.0720 1488.2915 1491.7828 1592.3868 1613.5334 1697.9197 1768.8055 2989.8731 2995.0172 3025.5510 3043.2962 3079.0752 3087.3750 3090.3864 3110.3187 3125.9960 3137.6067 3148.5221 3165.9129
redmass: 4.9275 5.8074 3.5546 5.1062 15.7285 6.2235 3.8792 2.9904 2.7452 1.0799 3.4662 8.7613 2.8237 3.2294 3.4136 3.5883 4.8700 9.9210 4.5310 6.3304 4.2444 4.9914 1.7519 2.2817 4.4606 3.2296 6.0854 2.8760 1.3280 1.4143 2.4479 1.3885 1.8424 5.0667 1.3250 2.2801 3.3281 1.7199 2.2666 2.1895 1.9408 4.4948 1.2637 1.0562 1.1153 2.0576 1.3142 1.3623 1.5517 1.5855 1.3215 1.4467 6.1282 1.2069 2.1504 1.0842 1.4223 1.4298 1.0581 5.9473 6.0376 12.8295 12.7857 1.0385 1.0821 1.0656 1.0829 1.0988 1.0986 1.0994 1.0885 1.0857 1.0907 1.0957 1.1014
irintensity: 0.7312 2.5589 1.0114 1.7518 2.3986 6.3061 0.4190 2.3235 1.3776 0.0331 3.2628 7.7827 0.0644 0.0915 9.8357 1.5093 8.2045 4.8563 46.7193 4.2946 1.7726 17.4897 46.0958 44.7842 4.6441 51.3297 139.1582 70.0954 9.2668 1.8221 28.0832 0.2212 12.7982 3.1285 0.0513 25.5133 123.0651 11.3097 2.3997 98.0670 74.9375 44.8536 0.3760 0.1245 0.2832 1.1772 1.3269 18.5396 2.3369 2.0587 2.8216 3.1714 0.3036 20.8381 10.9101 13.1084 13.2554 13.6977 18.0154 2.1282 6.8138 472.6247 144.7435 11.8081 8.0682 8.1761 4.0087 23.3404 3.5924 23.3313 10.3433 2.4013 9.2532 34.8050 20.2308
temp: 298.150 k
press: 1.00000 atm
elementType: 8 8 8 6 6 6 6 6 6 6 6 6 6 6 6 1 1 1 1 1 1 1 1 1 1 1 1
symmnumber: 1
zpe: 556093.7 jmol-1
zpe.correction: 0.211805 hartree
zpe.thermalcorrener: 0.225006 hartree
zpe.thermalcorrenthalpy: 0.225950 hartree
zpe.thermalcorrgfe: 0.170663 hartree
zpe.sumelectzpe: -689.072039 hartree
zpe.sumelectthermal: -689.058838 hartree
zpe.sumelectthermalent: -689.057894 hartree
zpe.sumelectthermalfe: -689.113180 hartree
dipole: 5.7185 0.4223 -0.8348
dipole: 5.7945
quadrupole: -104.9259 -95.6591 -82.4927
quadrupole: 2.2701 -1.4686 3.3355
quadrupole: -10.5667 -1.2999 11.8666 2.2701 -1.4686 3.3355
hfenergy: -689.2838438 hartree
pointgroup: C01 [X(C12H12O3)]
dipole: -2.2366553 -0.311094 -0.3126168 debye
polarizability: 159.9115472|11.0121614|126.7990522|14.4714433|-18.3936281|102.0679688 unknown
InChI: InChI=1S/C12H12O3/c1-8(9-5-3-2-4-6-9)10-7-11(13)15-12(10)14/h2-6,8,10H,7H2,1H3
charge 0 multiplicity 1
27 atoms
O  3.26522 0.126956 -0.028541
O  2.56163 2.293033 -0.545376
O  3.323896 -2.175972 0.359459
C  0.911842 0.413403 -0.572862
C  -0.097625 0.983179 0.499752
C  1.220468 -1.094637 -0.460285
C  -1.489249 0.392556 0.246527
C  0.424447 0.803326 1.942479
C  2.272616 1.100519 -0.418285
C  2.669573 -1.193917 0.007171
C  -2.276261 0.911015 -0.816529
C  -2.016845 -0.675941 1.01518
C  -3.548893 0.375887 -1.10894
C  -3.29136 -1.216127 0.725142
C  -4.060684 -0.69555 -0.339103
H  0.51028 0.674734 -1.567595
H  -0.148293 2.071191 0.294882
H  1.138246 -1.612932 -1.432512
H  0.560299 -1.634422 0.237999
H  -0.319755 1.176972 2.666904
H  1.356833 1.374816 2.096904
H  0.634407 -0.251978 2.196004
H  -1.893279 1.75222 -1.409604
H  -1.446134 -1.080572 1.85854
H  -4.143192 0.796075 -1.927962
H  -3.683973 -2.039091 1.332823
H  -5.049215 -1.111942 -0.561677
